"kenteken","voertuigsoort","merk","handelsbenaming","vervaldatum_apk","datum_tenaamstelling","bruto_bpm","inrichting","aantal_zitplaatsen","eerste_kleur","tweede_kleur","aantal_cilinders","cilinderinhoud","massa_ledig_voertuig","toegestane_maximum_massa_voertuig","massa_rijklaar","maximum_massa_trekken_ongeremd","maximum_trekken_massa_geremd","datum_eerste_toelating","datum_eerste_tenaamstelling_in_nederland","wacht_op_keuren","catalogusprijs","wam_verzekerd","maximale_constructiesnelheid","laadvermogen","oplegger_geremd","aanhangwagen_autonoom_geremd","aanhangwagen_middenas_geremd","aantal_staanplaatsen","aantal_deuren","aantal_wielen","afstand_hart_koppeling_tot_achterzijde_voertuig","afstand_voorzijde_voertuig_tot_hart_koppeling","afwijkende_maximum_snelheid","lengte","breedte","europese_voertuigcategorie","europese_voertuigcategorie_toevoeging","europese_uitvoeringcategorie_toevoeging","plaats_chassisnummer","technische_max_massa_voertuig","type","type_gasinstallatie","typegoedkeuringsnummer","variant","uitvoering","volgnummer_wijziging_eu_typegoedkeuring","vermogen_massarijklaar","wielbasis","export_indicator","openstaande_terugroepactie_indicator","vervaldatum_tachograaf","taxi_indicator","maximum_massa_samenstelling","aantal_rolstoelplaatsen","maximum_ondersteunende_snelheid","jaar_laatste_registratie_tellerstand","tellerstandoordeel","code_toelichting_tellerstandoordeel","tenaamstellen_mogelijk","vervaldatum_apk_dt","datum_tenaamstelling_dt","datum_eerste_toelating_dt","datum_eerste_tenaamstelling_in_nederland_dt","vervaldatum_tachograaf_dt","maximum_last_onder_de_vooras_sen_tezamen_koppeling","type_remsysteem_voertuig_code","rupsonderstelconfiguratiecode","wielbasis_voertuig_minimum","wielbasis_voertuig_maximum","lengte_voertuig_minimum","lengte_voertuig_maximum","breedte_voertuig_minimum","breedte_voertuig_maximum","hoogte_voertuig","hoogte_voertuig_minimum","hoogte_voertuig_maximum","massa_bedrijfsklaar_minimaal","massa_bedrijfsklaar_maximaal","technisch_toelaatbaar_massa_koppelpunt","maximum_massa_technisch_maximaal","maximum_massa_technisch_minimaal","subcategorie_nederland","verticale_belasting_koppelpunt_getrokken_voertuig","zuinigheidsclassificatie","registratie_datum_goedkeuring_afschrijvingsmoment_bpm","registratie_datum_goedkeuring_afschrijvingsmoment_bpm_dt","gem_lading_wrde","aerodyn_voorz","massa_alt_aandr","verl_cab_ind","api_gekentekende_voertuigen_assen","api_gekentekende_voertuigen_brandstof","api_gekentekende_voertuigen_carrosserie","api_gekentekende_voertuigen_carrosserie_specifiek","api_gekentekende_voertuigen_voertuigklasse"
"G740JN","Personenauto","PORSCHE","911 TARGA 4 GTS","20240308",,"28165","cabriolet","4","GRIJS","Niet geregistreerd","6","2981","1580","2040","1680",,,"20180308","20191004","Geen verstrekking in Open Data","188942","Nee","306",,,,,,"2","4","0","0",,"453","0","M1",,,,"2040","991",,"e13*2007/46*1187*15","TM22","29","0","0.20","245","Ja","Nee",,"Nee","0","0","0.00","2023","Geen oordeel","05","Nee","2024-03-08T00:00:00.000",,"2018-03-08T00:00:00.000","2019-10-04T00:00:00.000",,,,,,,,,,,"129",,,,,,,,,,"G",,,,,,,"https://opendata.rdw.nl/resource/3huj-srit.json","https://opendata.rdw.nl/resource/8ys7-d773.json","https://opendata.rdw.nl/resource/vezc-m2t6.json","https://opendata.rdw.nl/resource/jhie-znh9.json","https://opendata.rdw.nl/resource/kmfi-hrps.json"
"GX411Z","Personenauto","PORSCHE","911 TARGA 4 GTS","20240616","20240223","20662","cabriolet","4","ZWART","Niet geregistreerd","6","3800","1555","1980","1655",,,"20150529","20150914","Geen verstrekking in Open Data","192550","Nee",,,,,,,"2","4","0","0",,"0","0","M1",,,"r. bodemplaat by voorzitting","1980","991",,"e13*2007/46*1187*11","TC22","21","0","0.19","245","Ja","Nee",,"Nee","0","0",,"2024","Geen oordeel","05","Nee","2024-06-16T00:00:00.000","2024-02-23T00:00:00.000","2015-05-29T00:00:00.000","2015-09-14T00:00:00.000",,,,,,,,,,,,,,,,,,,,,"G",,,,,,,"https://opendata.rdw.nl/resource/3huj-srit.json","https://opendata.rdw.nl/resource/8ys7-d773.json","https://opendata.rdw.nl/resource/vezc-m2t6.json","https://opendata.rdw.nl/resource/jhie-znh9.json","https://opendata.rdw.nl/resource/kmfi-hrps.json"
"HJ231T","Personenauto","PORSCHE","911 TARGA 4 GTS","20240603",,"27295","cabriolet","4","BLAUW","Niet geregistreerd","6","3800","1555","1980","1655",,,"20151114","20151114","Geen verstrekking in Open Data","192041","Nee",,,,,,,"2","4","0","0",,"449","185","M1",,,"onder r. voorzitting","1980","991",,"e13*2007/46*1187*11","TC22","21","0","0.19","245","Ja","Nee",,"Nee","0","0",,"2023","Logisch","00","Nee","2024-06-03T00:00:00.000",,"2015-11-14T00:00:00.000","2015-11-14T00:00:00.000",,,,,,,,,,,"129",,,,,,,,,,"G",,,,,,,"https://opendata.rdw.nl/resource/3huj-srit.json","https://opendata.rdw.nl/resource/8ys7-d773.json","https://opendata.rdw.nl/resource/vezc-m2t6.json","https://opendata.rdw.nl/resource/jhie-znh9.json","https://opendata.rdw.nl/resource/kmfi-hrps.json"
"L140SX","Personenauto","PORSCHE","911 TARGA 4 GTS",,,"59458","cabriolet","4","GRIJS","Niet geregistreerd","6","2981","1660","2040","1760",,,"20180921","20210721","Geen verstrekking in Open Data","229244","Nee",,,,,,,"2","4",,,,,,"M1",,,"r. dwarsbalk by voorzitting","2040",,,,,,,"0.19","245","Ja","Nee",,"Nee",,,,"2021","Geen oordeel","05","Nee",,,"2018-09-21T00:00:00.000","2021-07-21T00:00:00.000",,,,,,,,,,,,,,,,,,,,,,,,,,,,"https://opendata.rdw.nl/resource/3huj-srit.json","https://opendata.rdw.nl/resource/8ys7-d773.json","https://opendata.rdw.nl/resource/vezc-m2t6.json","https://opendata.rdw.nl/resource/jhie-znh9.json","https://opendata.rdw.nl/resource/kmfi-hrps.json"
"N639NZ","Personenauto","PORSCHE","911 TARGA 4 GTS",,,"45566","cabriolet","4","GRIJS","Niet geregistreerd","6","2981","1660","2085","1760",,,"20211129","20211129","Geen verstrekking in Open Data","247527","Nee","307",,,,,,"2","4","0","0",,"453","185","M1",,,,"2085","992",,"e13*2007/46*0992*11","TC22","3410000","0","0.20","245","Ja","Nee",,"Nee","0","0","0.00","2022","Logisch","00","Nee",,,"2021-11-29T00:00:00.000","2021-11-29T00:00:00.000",,,,,,,,,,,"130",,,,,,,,,,"G","20211124","2021-11-24T00:00:00.000",,,,,"https://opendata.rdw.nl/resource/3huj-srit.json","https://opendata.rdw.nl/resource/8ys7-d773.json","https://opendata.rdw.nl/resource/vezc-m2t6.json","https://opendata.rdw.nl/resource/jhie-znh9.json","https://opendata.rdw.nl/resource/kmfi-hrps.json"
"NT835Z","Personenauto","PORSCHE","911 TARGA 4 GTS","20250424",,"26765","cabriolet","4","ROOD","Niet geregistreerd","6","2981","1580","2040","1680",,,"20170424","20170424","Geen verstrekking in Open Data","209093","Nee",,,,,,,"2","4","0","0",,"453","185","M1",,,"onder r. voorzitting","2040","991",,"e13*2007/46*1187*15","TM22","29","0","0.20","245","Ja","Nee",,"Nee","0","0","0.00","2023","Logisch","00","Nee","2025-04-24T00:00:00.000",,"2017-04-24T00:00:00.000","2017-04-24T00:00:00.000",,,,,,,,,,,"129",,,,,,,,,,"G",,,,,,,"https://opendata.rdw.nl/resource/3huj-srit.json","https://opendata.rdw.nl/resource/8ys7-d773.json","https://opendata.rdw.nl/resource/vezc-m2t6.json","https://opendata.rdw.nl/resource/jhie-znh9.json","https://opendata.rdw.nl/resource/kmfi-hrps.json"
"P446ZS","Personenauto","PORSCHE","911 TARGA 4 GTS",,,"48669","cabriolet","4","ZWART","Niet geregistreerd","6","2981","1660","2085","1760",,,"20220712","20220712","Geen verstrekking in Open Data","249631","Nee","307",,,,,,"2","4","0","0",,"453","185","M1",,,,"2085","992",,"e13*2007/46*0992*13","TC22","3410000","0","0.20","245","Ja","Nee",,"Nee","0","0","0.00","2023","Logisch","00","Nee",,,"2022-07-12T00:00:00.000","2022-07-12T00:00:00.000",,,,,,,,,,,"130",,,,,,,,,,"G","20220707","2022-07-07T00:00:00.000",,,,,"https://opendata.rdw.nl/resource/3huj-srit.json","https://opendata.rdw.nl/resource/8ys7-d773.json","https://opendata.rdw.nl/resource/vezc-m2t6.json","https://opendata.rdw.nl/resource/jhie-znh9.json","https://opendata.rdw.nl/resource/kmfi-hrps.json"
"P651RK","Personenauto","PORSCHE","911 TARGA 4 GTS",,,"48669","cabriolet","4","ZWART","Niet geregistreerd","6","2981","1660","2085","1760",,,"20220804","20220804","Geen verstrekking in Open Data","238147","Nee","307",,,,,,"2","4","0","0",,"453","185","M1",,,,"2085","992",,"e13*2007/46*0992*13","TC22","3410000","0","0.20","245","Ja","Nee",,"Nee","0","0","0.00","2022","Logisch","00","Nee",,,"2022-08-04T00:00:00.000","2022-08-04T00:00:00.000",,,,,,,,,,,"130",,,,,,,,,,"G","20220517","2022-05-17T00:00:00.000",,,,,"https://opendata.rdw.nl/resource/3huj-srit.json","https://opendata.rdw.nl/resource/8ys7-d773.json","https://opendata.rdw.nl/resource/vezc-m2t6.json","https://opendata.rdw.nl/resource/jhie-znh9.json","https://opendata.rdw.nl/resource/kmfi-hrps.json"
"PF347F","Personenauto","PORSCHE","911 TARGA 4 GTS","20241212",,"26765","cabriolet","4","GRIJS","Niet geregistreerd","6","2981","1580","2040","1680",,,"20170613","20170613","Geen verstrekking in Open Data","212351","Nee",,,,,,,"2","4","0","0",,"453","185","M1",,,"onder r. voorzitting","2040","991",,"e13*2007/46*1187*15","TM22","29","0","0.20","245","Ja","Nee",,"Nee","0","0","0.00","2022","Logisch","00","Nee","2024-12-12T00:00:00.000",,"2017-06-13T00:00:00.000","2017-06-13T00:00:00.000",,,,,,,,,,,"129",,,,,,,,,,"G",,,,,,,"https://opendata.rdw.nl/resource/3huj-srit.json","https://opendata.rdw.nl/resource/8ys7-d773.json","https://opendata.rdw.nl/resource/vezc-m2t6.json","https://opendata.rdw.nl/resource/jhie-znh9.json","https://opendata.rdw.nl/resource/kmfi-hrps.json"
"PF951J","Personenauto","PORSCHE","911 TARGA 4 GTS","20250328",,"26765","cabriolet","4","GRIJS","Niet geregistreerd","6","2981","1580","2040","1680",,,"20170613","20170613","Geen verstrekking in Open Data","204153","Ja",,,,,,,"2","4","0","0",,"453","185","M1",,,"onder r. voorzitting","2040","991",,"e13*2007/46*1187*15","TM22","29","0","0.20","245","Ja","Nee",,"Nee","0","0","0.00","2023","Logisch","00","Nee","2025-03-28T00:00:00.000",,"2017-06-13T00:00:00.000","2017-06-13T00:00:00.000",,,,,,,,,,,"129",,,,,,,,,,"G",,,,,,,"https://opendata.rdw.nl/resource/3huj-srit.json","https://opendata.rdw.nl/resource/8ys7-d773.json","https://opendata.rdw.nl/resource/vezc-m2t6.json","https://opendata.rdw.nl/resource/jhie-znh9.json","https://opendata.rdw.nl/resource/kmfi-hrps.json"
"PK791G","Personenauto","PORSCHE","911 TARGA 4 GTS",,,"27295","cabriolet","4","BLAUW","Niet geregistreerd","6","3800","1555","1980","1655",,,"20150428","20170714","Geen verstrekking in Open Data","172401","Nee",,,,,,,"2","4","0","0",,"0","0","M1",,,"r. bodemplaat by voorzitting","1980","991",,"e13*2007/46*1187*11","TC22","21","0","0.19","245","Ja","Nee",,"Nee","0","0",,"2023","Geen oordeel","05","Nee",,,"2015-04-28T00:00:00.000","2017-07-14T00:00:00.000",,,,,,,,,,,,,,,,,,,,,"G",,,,,,,"https://opendata.rdw.nl/resource/3huj-srit.json","https://opendata.rdw.nl/resource/8ys7-d773.json","https://opendata.rdw.nl/resource/vezc-m2t6.json","https://opendata.rdw.nl/resource/jhie-znh9.json","https://opendata.rdw.nl/resource/kmfi-hrps.json"
"PL089N","Personenauto","PORSCHE","911 TARGA 4 GTS","20241115",,"26765","cabriolet","4","ZWART","Niet geregistreerd","6","2981","1580","2040","1680",,,"20170726","20170726","Geen verstrekking in Open Data","212035","Nee",,,,,,,"2","4","0","0",,"453","185","M1",,,"onder r. voorzitting","2040","991",,"e13*2007/46*1187*16","TM22","29","0","0.20","245","Ja","Nee",,"Nee","0","0","0.00","2023","Logisch","00","Nee","2024-11-15T00:00:00.000",,"2017-07-26T00:00:00.000","2017-07-26T00:00:00.000",,,,,,,,,,,"129",,,,,,,,,,"G",,,,,,,"https://opendata.rdw.nl/resource/3huj-srit.json","https://opendata.rdw.nl/resource/8ys7-d773.json","https://opendata.rdw.nl/resource/vezc-m2t6.json","https://opendata.rdw.nl/resource/jhie-znh9.json","https://opendata.rdw.nl/resource/kmfi-hrps.json"
"PL328Z","Personenauto","PORSCHE","911 TARGA 4 GTS","20230811",,"26765","cabriolet","4","GRIJS","Niet geregistreerd","6","2981","1580","2040","1680",,,"20170803","20170803","Geen verstrekking in Open Data","200032","Nee",,,,,,,"2","4","0","0",,"453","185","M1",,,"onder r. voorzitting","2040","991",,"e13*2007/46*1187*16","TM22","29","0","0.20","245","Ja","Nee",,"Nee","0","0","0.00","2023","Logisch","00","Nee","2023-08-11T00:00:00.000",,"2017-08-03T00:00:00.000","2017-08-03T00:00:00.000",,,,,,,,,,,"129",,,,,,,,,,"G",,,,,,,"https://opendata.rdw.nl/resource/3huj-srit.json","https://opendata.rdw.nl/resource/8ys7-d773.json","https://opendata.rdw.nl/resource/vezc-m2t6.json","https://opendata.rdw.nl/resource/jhie-znh9.json","https://opendata.rdw.nl/resource/kmfi-hrps.json"
"R394HP","Personenauto","PORSCHE","911 TARGA 4 GTS",,,"49117","cabriolet","4","ZWART","Niet geregistreerd","6","2981","1660","2085","1760",,,"20220908","20220908","Geen verstrekking in Open Data","276931","Nee","307",,,,,,"2","4","0","0",,"453","185","M1",,,,"2085","992",,"e13*2007/46*0992*13","TC22","3410000","0","0.20","245","Ja","Nee",,"Nee","0","0","0.00","2022","Logisch","00","Nee",,,"2022-09-08T00:00:00.000","2022-09-08T00:00:00.000",,,,,,,,,,,"130",,,,,,,,,,"G","20220902","2022-09-02T00:00:00.000",,,,,"https://opendata.rdw.nl/resource/3huj-srit.json","https://opendata.rdw.nl/resource/8ys7-d773.json","https://opendata.rdw.nl/resource/vezc-m2t6.json","https://opendata.rdw.nl/resource/jhie-znh9.json","https://opendata.rdw.nl/resource/kmfi-hrps.json"
"R713HJ","Personenauto","PORSCHE","911 TARGA 4 GTS",,,"48669","cabriolet","4","ZWART","Niet geregistreerd","6","2981","1660","2085","1760",,,"20220919","20220919","Geen verstrekking in Open Data","250838","Nee","307",,,,,,"2","4","0","0",,"453","185","M1",,,,"2085","992",,"e13*2007/46*0992*13","TC22","3410000","0","0.20","245","Ja","Nee",,"Nee","0","0","0.00","2023","Logisch","00","Nee",,,"2022-09-19T00:00:00.000","2022-09-19T00:00:00.000",,,,,,,,,,,"130",,,,,,,,,,"G","20220831","2022-08-31T00:00:00.000",,,,,"https://opendata.rdw.nl/resource/3huj-srit.json","https://opendata.rdw.nl/resource/8ys7-d773.json","https://opendata.rdw.nl/resource/vezc-m2t6.json","https://opendata.rdw.nl/resource/jhie-znh9.json","https://opendata.rdw.nl/resource/kmfi-hrps.json"
"R910FD","Personenauto","PORSCHE","911 TARGA 4 GTS",,,"48669","cabriolet","4","ZWART","Niet geregistreerd","6","2981","1660","2085","1760",,,"20220826","20220826","Geen verstrekking in Open Data","257004","Nee","307",,,,,,"2","4","0","0",,"453","185","M1",,,,"2085","992",,"e13*2007/46*0992*13","TC22","3410000","0","0.20","245","Ja","Nee",,"Nee","0","0","0.00","2022","Logisch","00","Nee",,,"2022-08-26T00:00:00.000","2022-08-26T00:00:00.000",,,,,,,,,,,"130",,,,,,,,,,"G","20220804","2022-08-04T00:00:00.000",,,,,"https://opendata.rdw.nl/resource/3huj-srit.json","https://opendata.rdw.nl/resource/8ys7-d773.json","https://opendata.rdw.nl/resource/vezc-m2t6.json","https://opendata.rdw.nl/resource/jhie-znh9.json","https://opendata.rdw.nl/resource/kmfi-hrps.json"
"RH305K","Personenauto","PORSCHE","911 TARGA 4 GTS","20230630",,"27295","cabriolet","4","ZWART","Niet geregistreerd","6","3800","1555","1980","1655",,,"20150508","20171201","Geen verstrekking in Open Data","192014","Nee",,,,,,,"2","4","0","0",,"0","0","M1",,,"r. bodemplaat by voorzitting","1980","991",,"e13*2007/46*1187*11","TC22","21","0","0.19","245","Ja","Nee",,"Nee","0","0",,"2022","Geen oordeel","05","Nee","2023-06-30T00:00:00.000",,"2015-05-08T00:00:00.000","2017-12-01T00:00:00.000",,,,,,,,,,,,,,,,,,,,,"G",,,,,,,"https://opendata.rdw.nl/resource/3huj-srit.json","https://opendata.rdw.nl/resource/8ys7-d773.json","https://opendata.rdw.nl/resource/vezc-m2t6.json","https://opendata.rdw.nl/resource/jhie-znh9.json","https://opendata.rdw.nl/resource/kmfi-hrps.json"
"RP536D","Personenauto","PORSCHE","911 TARGA 4 GTS","20260107","20240215","26765","cabriolet","4","GRIJS","Niet geregistreerd","6","2981","1580","2040","1680",,,"20180102","20180102","Geen verstrekking in Open Data","209544","Ja",,,,,,,"2","4","0","0",,"453","185","M1",,,"onder r. voorzitting","2040","991",,"e13*2007/46*1187*16","TM22","29","0","0.20","245","Ja","Nee",,"Nee","0","0","0.00","2024","Logisch","00","Nee","2026-01-07T00:00:00.000","2024-02-15T00:00:00.000","2018-01-02T00:00:00.000","2018-01-02T00:00:00.000",,,,,,,,,,,"129",,,,,,,,,,"G",,,,,,,"https://opendata.rdw.nl/resource/3huj-srit.json","https://opendata.rdw.nl/resource/8ys7-d773.json","https://opendata.rdw.nl/resource/vezc-m2t6.json","https://opendata.rdw.nl/resource/jhie-znh9.json","https://opendata.rdw.nl/resource/kmfi-hrps.json"
"S360HV","Personenauto","PORSCHE","911 TARGA 4 GTS",,,"54570","cabriolet","4","GRIJS","Niet geregistreerd","6","2981","1660","2085","1760",,,"20230207","20230207","Geen verstrekking in Open Data","259423","Nee","307",,,,,,"2","4",,,,"453","185","M1",,,,"2085","992",,"e13*2007/46*0992*14","TC22","3410000","0","0.20","245","Ja","Nee",,"Nee",,,,"2023","Logisch","00","Nee",,,"2023-02-07T00:00:00.000","2023-02-07T00:00:00.000",,,,,,,,,,,"130",,,,,,,,,,"G","20230126","2023-01-26T00:00:00.000",,,,,"https://opendata.rdw.nl/resource/3huj-srit.json","https://opendata.rdw.nl/resource/8ys7-d773.json","https://opendata.rdw.nl/resource/vezc-m2t6.json","https://opendata.rdw.nl/resource/jhie-znh9.json","https://opendata.rdw.nl/resource/kmfi-hrps.json"
"S468BV","Personenauto","PORSCHE","911 TARGA 4 GTS",,,"54570","cabriolet","4","ZWART","Niet geregistreerd","6","2981","1660","2085","1760",,,"20230302","20230302","Geen verstrekking in Open Data","274247","Ja","307",,,,,,"2","4",,,,"453","185","M1",,,,"2085","992",,"e13*2007/46*0992*14","TC22","3410000","0","0.20","245","Ja","Nee",,"Nee",,,,"2023","Logisch","00","Nee",,,"2023-03-02T00:00:00.000","2023-03-02T00:00:00.000",,,,,,,,,,,"130",,,,,,,,,,"G","20221227","2022-12-27T00:00:00.000",,,,,"https://opendata.rdw.nl/resource/3huj-srit.json","https://opendata.rdw.nl/resource/8ys7-d773.json","https://opendata.rdw.nl/resource/vezc-m2t6.json","https://opendata.rdw.nl/resource/jhie-znh9.json","https://opendata.rdw.nl/resource/kmfi-hrps.json"
"SH104F","Personenauto","PORSCHE","911 TARGA 4 GTS","20240411",,"28165","cabriolet","4","ZWART","Niet geregistreerd","6","2981","1580","2040","1680",,,"20180406","20180406","Geen verstrekking in Open Data","217186","Nee",,,,,,,"2","4","0","0",,"453","185","M1",,,"onder r. voorzitting","2040","991",,"e13*2007/46*1187*18","TM22","29","0","0.20","245","Ja","Nee",,"Nee","0","0","0.00","2023","Logisch","00","Nee","2024-04-11T00:00:00.000",,"2018-04-06T00:00:00.000","2018-04-06T00:00:00.000",,,,,,,,,,,"129",,,,,,,,,,"G",,,,,,,"https://opendata.rdw.nl/resource/3huj-srit.json","https://opendata.rdw.nl/resource/8ys7-d773.json","https://opendata.rdw.nl/resource/vezc-m2t6.json","https://opendata.rdw.nl/resource/jhie-znh9.json","https://opendata.rdw.nl/resource/kmfi-hrps.json"
"SL427L","Personenauto","PORSCHE","911 TARGA 4 GTS","20250905",,"20679","cabriolet","4","GRIJS","Niet geregistreerd","6","2981","1580","2040","1680",,,"20180104","20180502","Geen verstrekking in Open Data","218865","Nee",,,,,,,"2","4","0","0",,"453","0","M1",,,"r. bodemplaat by voorzitting","2040","991",,"e13*2007/46*1187*16","TM22","29","0","0.20","245","Ja","Nee",,"Nee","0","0","0.00","2023","Geen oordeel","05","Nee","2025-09-05T00:00:00.000",,"2018-01-04T00:00:00.000","2018-05-02T00:00:00.000",,,,,,,,,,,,,,,,,,,,,"G",,,,,,,"https://opendata.rdw.nl/resource/3huj-srit.json","https://opendata.rdw.nl/resource/8ys7-d773.json","https://opendata.rdw.nl/resource/vezc-m2t6.json","https://opendata.rdw.nl/resource/jhie-znh9.json","https://opendata.rdw.nl/resource/kmfi-hrps.json"
"TH294X","Personenauto","PORSCHE","911 TARGA 4 GTS","20241117",,"28165","cabriolet","4","GRIJS","Niet geregistreerd","6","2981","1580","2040","1680",,,"20180810","20180810","Geen verstrekking in Open Data","221972","Nee",,,,,,,"2","4","0","0",,"453","185","M1",,,,"2040","991",,"e13*2007/46*1187*16","TM22","29","0","0.20","245","Ja","Nee",,"Nee","0","0","0.00","2022","Logisch","00","Nee","2024-11-17T00:00:00.000",,"2018-08-10T00:00:00.000","2018-08-10T00:00:00.000",,,,,,,,,,,"129",,,,,,,,,,"G",,,,,,,"https://opendata.rdw.nl/resource/3huj-srit.json","https://opendata.rdw.nl/resource/8ys7-d773.json","https://opendata.rdw.nl/resource/vezc-m2t6.json","https://opendata.rdw.nl/resource/jhie-znh9.json","https://opendata.rdw.nl/resource/kmfi-hrps.json"
"XL708G","Personenauto","PORSCHE","911 TARGA 4 GTS","20260221","20220610","20310","cabriolet","4","GRIJS","Niet geregistreerd","6","2981","1580","2040","1680",,,"20170606","20190129","Geen verstrekking in Open Data","190923","Ja",,,,,,,"2","4","0","0",,"453","0","M1",,,,"2040","991",,"e13*2007/46*1187*15","TM22","29","0","0.20","245","Ja","Nee",,"Nee","0","0","0.00","2024","Geen oordeel","05","Nee","2026-02-21T00:00:00.000","2022-06-10T00:00:00.000","2017-06-06T00:00:00.000","2019-01-29T00:00:00.000",,,,,,,,,,,,,,,,,,,,,"G",,,,,,,"https://opendata.rdw.nl/resource/3huj-srit.json","https://opendata.rdw.nl/resource/8ys7-d773.json","https://opendata.rdw.nl/resource/vezc-m2t6.json","https://opendata.rdw.nl/resource/jhie-znh9.json","https://opendata.rdw.nl/resource/kmfi-hrps.json"
