"kenteken","voertuigsoort","merk","handelsbenaming","vervaldatum_apk","datum_tenaamstelling","bruto_bpm","inrichting","aantal_zitplaatsen","eerste_kleur","tweede_kleur","aantal_cilinders","cilinderinhoud","massa_ledig_voertuig","toegestane_maximum_massa_voertuig","massa_rijklaar","maximum_massa_trekken_ongeremd","maximum_trekken_massa_geremd","datum_eerste_toelating","datum_eerste_tenaamstelling_in_nederland","wacht_op_keuren","catalogusprijs","wam_verzekerd","maximale_constructiesnelheid","laadvermogen","oplegger_geremd","aanhangwagen_autonoom_geremd","aanhangwagen_middenas_geremd","aantal_staanplaatsen","aantal_deuren","aantal_wielen","afstand_hart_koppeling_tot_achterzijde_voertuig","afstand_voorzijde_voertuig_tot_hart_koppeling","afwijkende_maximum_snelheid","lengte","breedte","europese_voertuigcategorie","europese_voertuigcategorie_toevoeging","europese_uitvoeringcategorie_toevoeging","plaats_chassisnummer","technische_max_massa_voertuig","type","type_gasinstallatie","typegoedkeuringsnummer","variant","uitvoering","volgnummer_wijziging_eu_typegoedkeuring","vermogen_massarijklaar","wielbasis","export_indicator","openstaande_terugroepactie_indicator","vervaldatum_tachograaf","taxi_indicator","maximum_massa_samenstelling","aantal_rolstoelplaatsen","maximum_ondersteunende_snelheid","jaar_laatste_registratie_tellerstand","tellerstandoordeel","code_toelichting_tellerstandoordeel","tenaamstellen_mogelijk","vervaldatum_apk_dt","datum_tenaamstelling_dt","datum_eerste_toelating_dt","datum_eerste_tenaamstelling_in_nederland_dt","vervaldatum_tachograaf_dt","maximum_last_onder_de_vooras_sen_tezamen_koppeling","type_remsysteem_voertuig_code","rupsonderstelconfiguratiecode","wielbasis_voertuig_minimum","wielbasis_voertuig_maximum","lengte_voertuig_minimum","lengte_voertuig_maximum","breedte_voertuig_minimum","breedte_voertuig_maximum","hoogte_voertuig","hoogte_voertuig_minimum","hoogte_voertuig_maximum","massa_bedrijfsklaar_minimaal","massa_bedrijfsklaar_maximaal","technisch_toelaatbaar_massa_koppelpunt","maximum_massa_technisch_maximaal","maximum_massa_technisch_minimaal","subcategorie_nederland","verticale_belasting_koppelpunt_getrokken_voertuig","zuinigheidsclassificatie","registratie_datum_goedkeuring_afschrijvingsmoment_bpm","registratie_datum_goedkeuring_afschrijvingsmoment_bpm_dt","gem_lading_wrde","aerodyn_voorz","massa_alt_aandr","verl_cab_ind","api_gekentekende_voertuigen_assen","api_gekentekende_voertuigen_brandstof","api_gekentekende_voertuigen_carrosserie","api_gekentekende_voertuigen_carrosserie_specifiek","api_gekentekende_voertuigen_voertuigklasse"
"3ZNB93","Personenauto","PORSCHE","911 CARRERA 4 GTS","20231102",,"26427","coupe","4","ZWART","Niet geregistreerd","6","3800","1465","1895","1565",,,"20150131","20150131","Geen verstrekking in Open Data","179228","Nee",,,,,,,"2","4","0","0",,"0","0","M1",,,"r. bodemplaat by voorzitting","1895","991",,"e13*2007/46*1187*10","CC22","21","0","0.20","245","Ja","Nee",,"Nee","0","0",,"2023","Logisch","00","Nee","2023-11-02T00:00:00.000",,"2015-01-31T00:00:00.000","2015-01-31T00:00:00.000",,,,,,,,,,,,,,,,,,,,,"G",,,,,,,"https://opendata.rdw.nl/resource/3huj-srit.json","https://opendata.rdw.nl/resource/8ys7-d773.json","https://opendata.rdw.nl/resource/vezc-m2t6.json","https://opendata.rdw.nl/resource/jhie-znh9.json","https://opendata.rdw.nl/resource/kmfi-hrps.json"
"GN487X","Personenauto","PORSCHE","911 CARRERA 4 GTS","20231216","20231006","26427","coupe","4","ZWART","Niet geregistreerd","6","3800","1465","1895","1565",,,"20150704","20150704","Geen verstrekking in Open Data","183701","Ja",,,,,,,"2","4","0","0",,"0","0","M1",,,"r. bodemplaat by voorzitting","1895","991",,"e13*2007/46*1187*10","CC22","21","0","0.20","245","Ja","Nee",,"Nee","0","0",,"2024","Logisch","00","Nee","2023-12-16T00:00:00.000","2023-10-06T00:00:00.000","2015-07-04T00:00:00.000","2015-07-04T00:00:00.000",,,,,,,,,,,,,,,,,,,,,"G",,,,,,,"https://opendata.rdw.nl/resource/3huj-srit.json","https://opendata.rdw.nl/resource/8ys7-d773.json","https://opendata.rdw.nl/resource/vezc-m2t6.json","https://opendata.rdw.nl/resource/jhie-znh9.json","https://opendata.rdw.nl/resource/kmfi-hrps.json"
"GR587X","Personenauto","PORSCHE","911 CARRERA 4 GTS","20230730",,"27295","cabriolet","4","GRIJS","Niet geregistreerd","6","3800","1535","1955","1635",,,"20150730","20150730","Geen verstrekking in Open Data","192969","Nee",,,,,,,"2","4","0","0",,"0","0","M1",,,"r. bodemplaat by voorzitting","1955","991",,"e13*2007/46*1187*11","KC22","21","0","0.19","245","Ja","Nee",,"Nee","0","0",,"2021","Logisch","00","Nee","2023-07-30T00:00:00.000",,"2015-07-30T00:00:00.000","2015-07-30T00:00:00.000",,,,,,,,,,,,,,,,,,,,,"G",,,,,,,"https://opendata.rdw.nl/resource/3huj-srit.json","https://opendata.rdw.nl/resource/8ys7-d773.json","https://opendata.rdw.nl/resource/vezc-m2t6.json","https://opendata.rdw.nl/resource/jhie-znh9.json","https://opendata.rdw.nl/resource/kmfi-hrps.json"
"HG258L","Personenauto","PORSCHE","911 CARRERA 4 GTS","20231029",,"26427","coupe","4","GRIJS","Niet geregistreerd","6","3800","1465","1895","1565",,,"20151029","20151029","Geen verstrekking in Open Data","183934","Nee",,,,,,,"2","4","0","0",,"449","185","M1",,,"onder r. voorzitting","1895","991",,"e13*2007/46*1187*10","CC22","21","0","0.20","245","Ja","Nee",,"Nee","0","0",,"2022","Logisch","00","Nee","2023-10-29T00:00:00.000",,"2015-10-29T00:00:00.000","2015-10-29T00:00:00.000",,,,,,,,,,,"129",,,,,,,,,,"G",,,,,,,"https://opendata.rdw.nl/resource/3huj-srit.json","https://opendata.rdw.nl/resource/8ys7-d773.json","https://opendata.rdw.nl/resource/vezc-m2t6.json","https://opendata.rdw.nl/resource/jhie-znh9.json","https://opendata.rdw.nl/resource/kmfi-hrps.json"
"JH963P","Personenauto","PORSCHE","911 CARRERA 4 GTS","20231221",,"21573","cabriolet","4","GRIJS","Niet geregistreerd","6","3800","1535","1955","1635",,,"20150717","20160322","Geen verstrekking in Open Data","194245","Nee",,,,,,,"2","4","0","0",,"0","0","M1",,,"r. bodemplaat by voorzitting","1955","991",,"e13*2007/46*1187*11","KC22","21","0","0.19","245","Ja","Nee",,"Nee","0","0",,"2023","Geen oordeel","05","Nee","2023-12-21T00:00:00.000",,"2015-07-17T00:00:00.000","2016-03-22T00:00:00.000",,,,,,,,,,,,,,,,,,,,,"G",,,,,,,"https://opendata.rdw.nl/resource/3huj-srit.json","https://opendata.rdw.nl/resource/8ys7-d773.json","https://opendata.rdw.nl/resource/vezc-m2t6.json","https://opendata.rdw.nl/resource/jhie-znh9.json","https://opendata.rdw.nl/resource/kmfi-hrps.json"
"JK473V","Personenauto","PORSCHE","911 CARRERA 4 GTS","20241218",,"23763","coupe","4","ZWART","Niet geregistreerd","6","3800","1465","1895","1565",,,"20150407","20160422","Geen verstrekking in Open Data","173253","Nee",,,,,,,"2","4","0","0",,"0","0","M1",,,"r. bodemplaat by voorzitting","1895","991",,"e13*2007/46*1187*10","CC22","21","0","0.20","245","Ja","Nee",,"Nee","0","0",,"2023","Geen oordeel","05","Nee","2024-12-18T00:00:00.000",,"2015-04-07T00:00:00.000","2016-04-22T00:00:00.000",,,,,,,,,,,,,,,,,,,,,"G",,,,,,,"https://opendata.rdw.nl/resource/3huj-srit.json","https://opendata.rdw.nl/resource/8ys7-d773.json","https://opendata.rdw.nl/resource/vezc-m2t6.json","https://opendata.rdw.nl/resource/jhie-znh9.json","https://opendata.rdw.nl/resource/kmfi-hrps.json"
"K552PL","Personenauto","PORSCHE","911 CARRERA 4 GTS",,,"27550","coupe","4","GRIJS","Niet geregistreerd","6","2981","1490","1965","1590",,,"20181218","20210508","Geen verstrekking in Open Data","232635","Nee","308",,,,,,"2","4","0","0",,"453","0","M1",,,"r. bodemplaat by voorzitting","1965","991",,"e13*2007/46*1187*19","CM22","39","1","0.21","245","Ja","Nee",,"Nee","0","0","0.00","2022","Geen oordeel","05","Nee",,,"2018-12-18T00:00:00.000","2021-05-08T00:00:00.000",,,,,,,,,,,,,,,,,,,,,,,,,,,,"https://opendata.rdw.nl/resource/3huj-srit.json","https://opendata.rdw.nl/resource/8ys7-d773.json","https://opendata.rdw.nl/resource/vezc-m2t6.json","https://opendata.rdw.nl/resource/jhie-znh9.json","https://opendata.rdw.nl/resource/kmfi-hrps.json"
"K630ZK","Personenauto","PORSCHE","911 CARRERA 4 GTS",,,"26764","cabriolet","4","GRIJS","Niet geregistreerd","6","2981","1560","2015","1660",,,"20171228","20210331","Geen verstrekking in Open Data","198641","Nee","306",,,,,,"2","4","0","0",,"453","0","M1",,,,"2015","991",,"e13*2007/46*1187*15","KM22","29","0","0.20","245","Ja","Nee",,"Nee","0","0","0.00","2022","Geen oordeel","05","Nee",,,"2017-12-28T00:00:00.000","2021-03-31T00:00:00.000",,,,,,,,,,,"129",,,,,,,,,,"G",,,,,,,"https://opendata.rdw.nl/resource/3huj-srit.json","https://opendata.rdw.nl/resource/8ys7-d773.json","https://opendata.rdw.nl/resource/vezc-m2t6.json","https://opendata.rdw.nl/resource/jhie-znh9.json","https://opendata.rdw.nl/resource/kmfi-hrps.json"
"N921PD","Personenauto","PORSCHE","911 CARRERA 4 GTS","20230805",,"38006","coupe","4","ZWART","Niet geregistreerd","6","3800","1455","1880","1555",,,"20110805","20211125","Geen verstrekking in Open Data","177800","Nee","302",,,,,,"2","4",,,,"444","185","M1",,,"r. tegen schutbord in kofferruimte","1880","997",,"e13*2001/116*0137*16","CF21","05","0","0.19","235","Ja","Nee",,"Nee",,,,"2022","Geen oordeel","05","Nee","2023-08-05T00:00:00.000",,"2011-08-05T00:00:00.000","2021-11-25T00:00:00.000",,,,,,,,,,,,,,,,,,,,,,"20211014","2021-10-14T00:00:00.000",,,,,"https://opendata.rdw.nl/resource/3huj-srit.json","https://opendata.rdw.nl/resource/8ys7-d773.json","https://opendata.rdw.nl/resource/vezc-m2t6.json","https://opendata.rdw.nl/resource/jhie-znh9.json","https://opendata.rdw.nl/resource/kmfi-hrps.json"
"NX439D","Personenauto","PORSCHE","911 CARRERA 4 GTS","20231210",,"24865","coupe","4","GRIJS","Niet geregistreerd","6","2981","1490","1965","1590",,,"20170505","20170505","Geen verstrekking in Open Data","209368","Nee",,,,,,,"2","4","0","0",,"453","185","M1",,,"onder r. voorzitting","1965","991",,"e13*2007/46*1187*15","CM22","29","0","0.21","245","Ja","Nee",,"Nee","0","0","0.00","2023","Logisch","00","Nee","2023-12-10T00:00:00.000",,"2017-05-05T00:00:00.000","2017-05-05T00:00:00.000",,,,,,,,,,,"128",,,,,,,,,,"G",,,,,,,"https://opendata.rdw.nl/resource/3huj-srit.json","https://opendata.rdw.nl/resource/8ys7-d773.json","https://opendata.rdw.nl/resource/vezc-m2t6.json","https://opendata.rdw.nl/resource/jhie-znh9.json","https://opendata.rdw.nl/resource/kmfi-hrps.json"
"P349RN","Personenauto","PORSCHE","911 CARRERA 4 GTS","20230523",,"26427","coupe","4","ZWART","Niet geregistreerd","6","3800","1465","1895","1565",,,"20150312","20220519","Geen verstrekking in Open Data","174886","Nee","302",,,,,,"2","4","0","0",,"0","185","M1",,,,"1895","991",,"e13*2007/46*1187*10","CC22","21","0","0.20","245","Ja","Nee",,"Nee","0","0",,"2022","Geen oordeel","05","Nee","2023-05-23T00:00:00.000",,"2015-03-12T00:00:00.000","2022-05-19T00:00:00.000",,,,,,,,,,,,,,,,,,,,,,"20220510","2022-05-10T00:00:00.000",,,,,"https://opendata.rdw.nl/resource/3huj-srit.json","https://opendata.rdw.nl/resource/8ys7-d773.json","https://opendata.rdw.nl/resource/vezc-m2t6.json","https://opendata.rdw.nl/resource/jhie-znh9.json","https://opendata.rdw.nl/resource/kmfi-hrps.json"
"P582KZ","Personenauto","PORSCHE","911 CARRERA 4 GTS",,,"29733","coupe","4","ZWART","Niet geregistreerd","6","2981","1570","2010","1670",,,"20220215","20220530","Geen verstrekking in Open Data","228203","Nee","309",,,,,,"2","4","0","0",,"453","185","M1",,,,"2010","992",,"e13*2007/46*0992*11","CC22","3410000","2","0.21","245","Ja","Nee",,"Nee","0","0","0.00","2022","Onlogisch","04","Nee",,,"2022-02-15T00:00:00.000","2022-05-30T00:00:00.000",,,,,,,,,,,,,,,,,,,,,,"20220406","2022-04-06T00:00:00.000",,,,,"https://opendata.rdw.nl/resource/3huj-srit.json","https://opendata.rdw.nl/resource/8ys7-d773.json","https://opendata.rdw.nl/resource/vezc-m2t6.json","https://opendata.rdw.nl/resource/jhie-znh9.json","https://opendata.rdw.nl/resource/kmfi-hrps.json"
"P960PG","Personenauto","PORSCHE","911 CARRERA 4 GTS",,,"49117","cabriolet","4","GRIJS","Niet geregistreerd","6","2981","1640","2065","1740",,,"20220506","20220506","Geen verstrekking in Open Data","266213","Nee","307",,,,,,"2","4","0","0",,"453","185","M1",,,,"2065","992",,"e13*2007/46*0992*13","KC22","3410000","0","0.20","245","Ja","Nee",,"Nee","0","0","0.00","2022","Logisch","00","Nee",,,"2022-05-06T00:00:00.000","2022-05-06T00:00:00.000",,,,,,,,,,,"129",,,,,,,,,,"G","20220503","2022-05-03T00:00:00.000",,,,,"https://opendata.rdw.nl/resource/3huj-srit.json","https://opendata.rdw.nl/resource/8ys7-d773.json","https://opendata.rdw.nl/resource/vezc-m2t6.json","https://opendata.rdw.nl/resource/jhie-znh9.json","https://opendata.rdw.nl/resource/kmfi-hrps.json"
"PB019Z","Personenauto","PORSCHE","911 CARRERA 4 GTS",,,"24865","coupe","4","GRIJS","Niet geregistreerd","6","2981","1490","1965","1590",,,"20170601","20170601","Geen verstrekking in Open Data","200801","Nee",,,,,,,"2","4","0","0",,"453","185","M1",,,"onder r. voorzitting","1965","991",,"e13*2007/46*1187*15","CM22","29","0","0.21","245","Ja","Nee",,"Nee","0","0","0.00","2023","Logisch","00","Nee",,,"2017-06-01T00:00:00.000","2017-06-01T00:00:00.000",,,,,,,,,,,"128",,,,,,,,,,"G",,,,,,,"https://opendata.rdw.nl/resource/3huj-srit.json","https://opendata.rdw.nl/resource/8ys7-d773.json","https://opendata.rdw.nl/resource/vezc-m2t6.json","https://opendata.rdw.nl/resource/jhie-znh9.json","https://opendata.rdw.nl/resource/kmfi-hrps.json"
"PB321L","Personenauto","PORSCHE","911 CARRERA 4 GTS",,,"26765","cabriolet","4","ZWART","Niet geregistreerd","6","2981","1560","2015","1660",,,"20170601","20170601","Geen verstrekking in Open Data","217581","Nee",,,,,,,"2","4","0","0",,"453","185","M1",,,"onder r. voorzitting","2015","991",,"e13*2007/46*1187*15","KM22","29","0","0.20","245","Ja","Nee",,"Nee","0","0","0.00","2022","Logisch","00","Nee",,,"2017-06-01T00:00:00.000","2017-06-01T00:00:00.000",,,,,,,,,,,"129",,,,,,,,,,"G",,,,,,,"https://opendata.rdw.nl/resource/3huj-srit.json","https://opendata.rdw.nl/resource/8ys7-d773.json","https://opendata.rdw.nl/resource/vezc-m2t6.json","https://opendata.rdw.nl/resource/jhie-znh9.json","https://opendata.rdw.nl/resource/kmfi-hrps.json"
"PJ944R","Personenauto","PORSCHE","911 CARRERA 4 GTS","20250705",,"26765","cabriolet","4","GRIJS","Niet geregistreerd","6","2981","1560","2015","1660",,,"20170705","20170705","Geen verstrekking in Open Data","212638","Nee",,,,,,,"2","4","0","0",,"453","185","M1",,,"onder r. voorzitting","2015","991",,"e13*2007/46*1187*15","KM22","29","0","0.20","245","Ja","Nee",,"Nee","0","0","0.00","2023","Logisch","00","Nee","2025-07-05T00:00:00.000",,"2017-07-05T00:00:00.000","2017-07-05T00:00:00.000",,,,,,,,,,,"129",,,,,,,,,,"G",,,,,,,"https://opendata.rdw.nl/resource/3huj-srit.json","https://opendata.rdw.nl/resource/8ys7-d773.json","https://opendata.rdw.nl/resource/vezc-m2t6.json","https://opendata.rdw.nl/resource/jhie-znh9.json","https://opendata.rdw.nl/resource/kmfi-hrps.json"
"RB327G","Personenauto","PORSCHE","911 CARRERA 4 GTS","20250217",,"26765","cabriolet","4","BLAUW","Niet geregistreerd","6","2981","1560","2015","1660",,,"20171021","20171021","Geen verstrekking in Open Data","205706","Nee",,,,,,,"2","4","0","0",,"453","185","M1",,,"onder r. voorzitting","2015","991",,"e13*2007/46*1187*15","KM22","29","0","0.20","245","Ja","Nee",,"Nee","0","0","0.00","2024","Logisch","00","Nee","2025-02-17T00:00:00.000",,"2017-10-21T00:00:00.000","2017-10-21T00:00:00.000",,,,,,,,,,,"129",,,,,,,,,,"G",,,,,,,"https://opendata.rdw.nl/resource/3huj-srit.json","https://opendata.rdw.nl/resource/8ys7-d773.json","https://opendata.rdw.nl/resource/vezc-m2t6.json","https://opendata.rdw.nl/resource/jhie-znh9.json","https://opendata.rdw.nl/resource/kmfi-hrps.json"
"RR718R","Personenauto","PORSCHE","911 CARRERA 4 GTS","20240105",,"26333","coupe","4","ZWART","Niet geregistreerd","6","2981","1490","1965","1590",,,"20180105","20180105","Geen verstrekking in Open Data","194051","Nee",,,,,,,"2","4","0","0",,"453","185","M1",,,"onder r. voorzitting","1965","991",,"e13*2007/46*1187*15","CM22","29","0","0.21","245","Ja","Nee",,"Nee","0","0","0.00","2023","Logisch","00","Nee","2024-01-05T00:00:00.000",,"2018-01-05T00:00:00.000","2018-01-05T00:00:00.000",,,,,,,,,,,"128",,,,,,,,,,"G",,,,,,,"https://opendata.rdw.nl/resource/3huj-srit.json","https://opendata.rdw.nl/resource/8ys7-d773.json","https://opendata.rdw.nl/resource/vezc-m2t6.json","https://opendata.rdw.nl/resource/jhie-znh9.json","https://opendata.rdw.nl/resource/kmfi-hrps.json"
"S030JV","Personenauto","PORSCHE","911 CARRERA 4 GTS",,,"54570","cabriolet","4","GRIJS","Niet geregistreerd","6","2981","1640","2065","1740",,,"20230214","20230214","Geen verstrekking in Open Data","271120","Nee","307",,,,,,"2","4","0","0",,"453","185","M1",,,,"2065","992",,"e13*2007/46*0992*14","KC22","3410000","0","0.20","245","Ja","Nee",,"Nee","0","0","0.00","2023","Logisch","00","Nee",,,"2023-02-14T00:00:00.000","2023-02-14T00:00:00.000",,,,,,,,,,,"129",,,,,,,,,,"G","20230206","2023-02-06T00:00:00.000",,,,,"https://opendata.rdw.nl/resource/3huj-srit.json","https://opendata.rdw.nl/resource/8ys7-d773.json","https://opendata.rdw.nl/resource/vezc-m2t6.json","https://opendata.rdw.nl/resource/jhie-znh9.json","https://opendata.rdw.nl/resource/kmfi-hrps.json"
"S223RK","Personenauto","PORSCHE","911 CARRERA 4 GTS",,,"52130","coupe","4","GROEN","Niet geregistreerd","6","2981","1570","2010","1670",,,"20230407","20230407","Geen verstrekking in Open Data","239829","Nee","309",,,,,,"2","4","0","0",,"453","185","M1",,,,"2010","992",,"e13*2007/46*0992*14","CC22","3410000","0","0.21","245","Ja","Nee",,"Nee","0","0","0.00","2023","Logisch","00","Nee",,,"2023-04-07T00:00:00.000","2023-04-07T00:00:00.000",,,,,,,,,,,"129",,,,,,,,,,"G","20230321","2023-03-21T00:00:00.000",,,,,"https://opendata.rdw.nl/resource/3huj-srit.json","https://opendata.rdw.nl/resource/8ys7-d773.json","https://opendata.rdw.nl/resource/vezc-m2t6.json","https://opendata.rdw.nl/resource/jhie-znh9.json","https://opendata.rdw.nl/resource/kmfi-hrps.json"
"S328ZF","Personenauto","PORSCHE","911 CARRERA 4 GTS",,,"44370","coupe","4","GRIJS","Niet geregistreerd","6","2981","1570","2010","1670",,,"20220426","20230627","Geen verstrekking in Open Data","240893","Nee","309",,,,,,"2","4","0","0",,"453","185","M1",,,,"2010","992",,"e13*2007/46*0992*13","CC22","3410000","0","0.21","245","Ja","Nee",,"Nee","0","0","0.00","2023","Geen oordeel","05","Nee",,,"2022-04-26T00:00:00.000","2023-06-27T00:00:00.000",,,,,,,,,,,"129",,,,,,,,,,,"20230423","2023-04-23T00:00:00.000",,,,,"https://opendata.rdw.nl/resource/3huj-srit.json","https://opendata.rdw.nl/resource/8ys7-d773.json","https://opendata.rdw.nl/resource/vezc-m2t6.json","https://opendata.rdw.nl/resource/jhie-znh9.json","https://opendata.rdw.nl/resource/kmfi-hrps.json"
"SF577D","Personenauto","PORSCHE","911 CARRERA 4 GTS","20240425",,"28165","cabriolet","4","ZWART","Niet geregistreerd","6","2981","1560","2015","1660",,,"20180316","20180316","Geen verstrekking in Open Data","213558","Nee",,,,,,,"2","4","0","0",,"453","185","M1",,,"onder r. voorzitting","2015","991",,"e13*2007/46*1187*15","KM22","29","0","0.20","245","Ja","Nee",,"Nee","0","0","0.00","2023","Logisch","00","Nee","2024-04-25T00:00:00.000",,"2018-03-16T00:00:00.000","2018-03-16T00:00:00.000",,,,,,,,,,,"129",,,,,,,,,,"G",,,,,,,"https://opendata.rdw.nl/resource/3huj-srit.json","https://opendata.rdw.nl/resource/8ys7-d773.json","https://opendata.rdw.nl/resource/vezc-m2t6.json","https://opendata.rdw.nl/resource/jhie-znh9.json","https://opendata.rdw.nl/resource/kmfi-hrps.json"
"SL831S","Personenauto","PORSCHE","911 CARRERA 4 GTS","20230609",,"24207","cabriolet","4","GRIJS","Niet geregistreerd","6","2981","1560","2015","1660",,,"20170609","20180505","Geen verstrekking in Open Data","234683","Nee",,,,,,,"2","4","0","0",,"453","0","M1",,,,"2015","991",,"e13*2007/46*1187*15","KM22","29","0","0.20","245","Ja","Nee",,"Nee","0","0","0.00","2023","Niet geregistreerd","NG","Nee","2023-06-09T00:00:00.000",,"2017-06-09T00:00:00.000","2018-05-05T00:00:00.000",,,,,,,,,,,,,,,,,,,,,"G",,,,,,,"https://opendata.rdw.nl/resource/3huj-srit.json","https://opendata.rdw.nl/resource/8ys7-d773.json","https://opendata.rdw.nl/resource/vezc-m2t6.json","https://opendata.rdw.nl/resource/jhie-znh9.json","https://opendata.rdw.nl/resource/kmfi-hrps.json"
"SP895J","Personenauto","PORSCHE","911 CARRERA 4 GTS","20240517",,"28165","cabriolet","4","ROOD","Niet geregistreerd","6","2981","1560","2015","1660",,,"20180517","20180517","Geen verstrekking in Open Data","207493","Nee",,,,,,,"2","4","0","0",,"453","185","M1",,,,"2015","991",,"e13*2007/46*1187*18","KM22","29","0","0.20","245","Ja","Nee",,"Nee","0","0","0.00","2023","Logisch","00","Nee","2024-05-17T00:00:00.000",,"2018-05-17T00:00:00.000","2018-05-17T00:00:00.000",,,,,,,,,,,"129",,,,,,,,,,"G",,,,,,,"https://opendata.rdw.nl/resource/3huj-srit.json","https://opendata.rdw.nl/resource/8ys7-d773.json","https://opendata.rdw.nl/resource/vezc-m2t6.json","https://opendata.rdw.nl/resource/jhie-znh9.json","https://opendata.rdw.nl/resource/kmfi-hrps.json"
"T157JS","Personenauto","PORSCHE","911 CARRERA 4 GTS",,,"35420","coupe","4","GROEN","Niet geregistreerd","6","2981","1570","2010","1670",,,"20230228","20230629","Geen verstrekking in Open Data","264745","Nee","309",,,,,,"2","4",,,,"453","185","M1",,,,"2010","992",,"e13*2007/46*0992*14","CC22","3410000","1","0.21","245","Ja","Nee",,"Nee",,,,"2023","Geen oordeel","05","Nee",,,"2023-02-28T00:00:00.000","2023-06-29T00:00:00.000",,,,,,,,,,,"129",,,,,,,,,,,"20230623","2023-06-23T00:00:00.000",,,,,"https://opendata.rdw.nl/resource/3huj-srit.json","https://opendata.rdw.nl/resource/8ys7-d773.json","https://opendata.rdw.nl/resource/vezc-m2t6.json","https://opendata.rdw.nl/resource/jhie-znh9.json","https://opendata.rdw.nl/resource/kmfi-hrps.json"
"T894KR","Personenauto","PORSCHE","911 CARRERA 4 GTS",,,"54082","cabriolet","4","GRIJS","Niet geregistreerd","6","2981","1640","2065","1740",,,"20230705","20230705","Geen verstrekking in Open Data","252419","Nee","307",,,,,,"2","4","0","0",,"453","185","M1",,,,"2065","992",,"e13*2007/46*0992*14","KC22","3410000","0","0.20","245","Ja","Nee",,"Nee","0","0","0.00","2023","Logisch","00","Nee",,,"2023-07-05T00:00:00.000","2023-07-05T00:00:00.000",,,,,,,,,,,"129",,,,,,,,,,"G","20230630","2023-06-30T00:00:00.000",,,,,"https://opendata.rdw.nl/resource/3huj-srit.json","https://opendata.rdw.nl/resource/8ys7-d773.json","https://opendata.rdw.nl/resource/vezc-m2t6.json","https://opendata.rdw.nl/resource/jhie-znh9.json","https://opendata.rdw.nl/resource/kmfi-hrps.json"
"TB016S","Personenauto","PORSCHE","911 CARRERA 4 GTS","20240704",,"28165","cabriolet","4","ZWART","Niet geregistreerd","6","2981","1560","2015","1660",,,"20180704","20180704","Geen verstrekking in Open Data","220197","Nee",,,,,,,"2","4","0","0",,"453","185","M1",,,,"2015","991",,"e13*2007/46*1187*18","KM22","29","0","0.20","245","Ja","Nee",,"Nee","0","0","0.00","2023","Logisch","00","Nee","2024-07-04T00:00:00.000",,"2018-07-04T00:00:00.000","2018-07-04T00:00:00.000",,,,,,,,,,,"129",,,,,,,,,,"G",,,,,,,"https://opendata.rdw.nl/resource/3huj-srit.json","https://opendata.rdw.nl/resource/8ys7-d773.json","https://opendata.rdw.nl/resource/vezc-m2t6.json","https://opendata.rdw.nl/resource/jhie-znh9.json","https://opendata.rdw.nl/resource/kmfi-hrps.json"