"kenteken","voertuigsoort","merk","handelsbenaming","vervaldatum_apk","datum_tenaamstelling","bruto_bpm","inrichting","aantal_zitplaatsen","eerste_kleur","tweede_kleur","aantal_cilinders","cilinderinhoud","massa_ledig_voertuig","toegestane_maximum_massa_voertuig","massa_rijklaar","maximum_massa_trekken_ongeremd","maximum_trekken_massa_geremd","datum_eerste_toelating","datum_eerste_tenaamstelling_in_nederland","wacht_op_keuren","catalogusprijs","wam_verzekerd","maximale_constructiesnelheid","laadvermogen","oplegger_geremd","aanhangwagen_autonoom_geremd","aanhangwagen_middenas_geremd","aantal_staanplaatsen","aantal_deuren","aantal_wielen","afstand_hart_koppeling_tot_achterzijde_voertuig","afstand_voorzijde_voertuig_tot_hart_koppeling","afwijkende_maximum_snelheid","lengte","breedte","europese_voertuigcategorie","europese_voertuigcategorie_toevoeging","europese_uitvoeringcategorie_toevoeging","plaats_chassisnummer","technische_max_massa_voertuig","type","type_gasinstallatie","typegoedkeuringsnummer","variant","uitvoering","volgnummer_wijziging_eu_typegoedkeuring","vermogen_massarijklaar","wielbasis","export_indicator","openstaande_terugroepactie_indicator","vervaldatum_tachograaf","taxi_indicator","maximum_massa_samenstelling","aantal_rolstoelplaatsen","maximum_ondersteunende_snelheid","jaar_laatste_registratie_tellerstand","tellerstandoordeel","code_toelichting_tellerstandoordeel","tenaamstellen_mogelijk","vervaldatum_apk_dt","datum_tenaamstelling_dt","datum_eerste_toelating_dt","datum_eerste_tenaamstelling_in_nederland_dt","vervaldatum_tachograaf_dt","maximum_last_onder_de_vooras_sen_tezamen_koppeling","type_remsysteem_voertuig_code","rupsonderstelconfiguratiecode","wielbasis_voertuig_minimum","wielbasis_voertuig_maximum","lengte_voertuig_minimum","lengte_voertuig_maximum","breedte_voertuig_minimum","breedte_voertuig_maximum","hoogte_voertuig","hoogte_voertuig_minimum","hoogte_voertuig_maximum","massa_bedrijfsklaar_minimaal","massa_bedrijfsklaar_maximaal","technisch_toelaatbaar_massa_koppelpunt","maximum_massa_technisch_maximaal","maximum_massa_technisch_minimaal","subcategorie_nederland","verticale_belasting_koppelpunt_getrokken_voertuig","zuinigheidsclassificatie","registratie_datum_goedkeuring_afschrijvingsmoment_bpm","registratie_datum_goedkeuring_afschrijvingsmoment_bpm_dt","gem_lading_wrde","aerodyn_voorz","massa_alt_aandr","verl_cab_ind","api_gekentekende_voertuigen_assen","api_gekentekende_voertuigen_brandstof","api_gekentekende_voertuigen_carrosserie","api_gekentekende_voertuigen_carrosserie_specifiek","api_gekentekende_voertuigen_voertuigklasse"
"V277JD","Bedrijfsauto","OPEL","VIVARO BUSINESSVAN","20230918",,"10294","gesloten opbouw","5","N.v.t.","N.v.t.","4","1598","1774","2940","1874","750",,"20170918","20170918","Geen verstrekking in Open Data","42516","Ja",,"1166",,,"2000",,"0","4","0","0",,"500","196","N1",,,"tussen r. voorzitting en deurdorpel","2940","F7-SA",,"e4*2007/46*0387*10","G013","5DB5","0","0.05","310","Ja","Nee",,"Nee","4940","0","0.00","2023","Logisch","00","Nee","2023-09-18T00:00:00.000",,"2017-09-18T00:00:00.000","2017-09-18T00:00:00.000",,,,,,,,,,,,,,,,,,,,,,,,,,,,"https://opendata.rdw.nl/resource/3huj-srit.json","https://opendata.rdw.nl/resource/8ys7-d773.json","https://opendata.rdw.nl/resource/vezc-m2t6.json","https://opendata.rdw.nl/resource/jhie-znh9.json","https://opendata.rdw.nl/resource/kmfi-hrps.json"
"V325LN","Bedrijfsauto","OPEL","VIVARO BUSINESSVAN","20240212",,"9622","gesloten opbouw","6","N.v.t.","N.v.t.","4","1598","1800","2800","1900","750",,"20180212","20180212","Geen verstrekking in Open Data","39627","Ja",,"1000",,,"2000",,"0","4","0","0",,"500","196","N1",,,"tussen r. voorzitting en deurdorpel","2800","F7-SA",,"e4*2007/46*0387*11","F002","ADB6","0","0.04","310","Ja","Nee",,"Nee","4800","0","0.00","2023","Logisch","00","Nee","2024-02-12T00:00:00.000",,"2018-02-12T00:00:00.000","2018-02-12T00:00:00.000",,,,,,,,,,,,,,,,,,,,,,,,,,,,"https://opendata.rdw.nl/resource/3huj-srit.json","https://opendata.rdw.nl/resource/8ys7-d773.json","https://opendata.rdw.nl/resource/vezc-m2t6.json","https://opendata.rdw.nl/resource/jhie-znh9.json","https://opendata.rdw.nl/resource/kmfi-hrps.json"
"V327LN","Bedrijfsauto","OPEL","VIVARO BUSINESSVAN","20240212",,"9622","gesloten opbouw","6","N.v.t.","N.v.t.","4","1598","1800","2800","1900","750",,"20180212","20180212","Geen verstrekking in Open Data","39627","Ja",,"1000",,,"2000",,"0","4","0","0",,"500","196","N1",,,"tussen r. voorzitting en deurdorpel","2800","F7-SA",,"e4*2007/46*0387*11","F002","ADB6","0","0.04","310","Ja","Nee",,"Nee","4800","0","0.00","2023","Logisch","00","Nee","2024-02-12T00:00:00.000",,"2018-02-12T00:00:00.000","2018-02-12T00:00:00.000",,,,,,,,,,,,,,,,,,,,,,,,,,,,"https://opendata.rdw.nl/resource/3huj-srit.json","https://opendata.rdw.nl/resource/8ys7-d773.json","https://opendata.rdw.nl/resource/vezc-m2t6.json","https://opendata.rdw.nl/resource/jhie-znh9.json","https://opendata.rdw.nl/resource/kmfi-hrps.json"
"V713RG","Bedrijfsauto","OPEL","VIVARO BUSINESSVAN","20250210","20211026","10725","gesloten opbouw","5","N.v.t.","N.v.t.","4","1995","1953","3030","2053","750",,"20131021","20180719","Geen verstrekking in Open Data","44272","Nee",,"1077",,,"2000",,"0","4","0","0",,"518","190","N1",,,"by bodemplaat r. voorzitting","3030","F7-SA",,"e4*2007/46*0387*03","B1B2","D1G5","0","0.04","350","Ja","Nee",,"Nee","5030","0","0.00","2024","Geen oordeel","05","Nee","2025-02-10T00:00:00.000","2021-10-26T00:00:00.000","2013-10-21T00:00:00.000","2018-07-19T00:00:00.000",,"0",,,,,,,,,,,,,,,,,,,,,,,,,,"https://opendata.rdw.nl/resource/3huj-srit.json","https://opendata.rdw.nl/resource/8ys7-d773.json","https://opendata.rdw.nl/resource/vezc-m2t6.json","https://opendata.rdw.nl/resource/jhie-znh9.json","https://opendata.rdw.nl/resource/kmfi-hrps.json"
"V771RH","Bedrijfsauto","OPEL","VIVARO BUSINESSVAN","20240320",,"10138","gesloten opbouw","6","N.v.t.","N.v.t.","4","1598","1800","2960","1900","750",,"20180720","20180720","Geen verstrekking in Open Data","41800","Nee",,"1160",,,"2000",,"0","4","0","0",,"500","196","N1",,,,"2960","F7-SA",,"e4*2007/46*0387*12","F012","ADB6","0","0.04","310","Ja","Nee",,"Nee","4960","0","0.00","2023","Logisch","00","Nee","2024-03-20T00:00:00.000",,"2018-07-20T00:00:00.000","2018-07-20T00:00:00.000",,,,,,,,,,,,,,,,,,,,,,,,,,,,"https://opendata.rdw.nl/resource/3huj-srit.json","https://opendata.rdw.nl/resource/8ys7-d773.json","https://opendata.rdw.nl/resource/vezc-m2t6.json","https://opendata.rdw.nl/resource/jhie-znh9.json","https://opendata.rdw.nl/resource/kmfi-hrps.json"
"VBT80Z","Bedrijfsauto","OPEL","VIVARO BUSINESSVAN","20240910",,"10133","gesloten opbouw","6","N.v.t.","N.v.t.","4","1598","1835","3040","1935","750",,"20190910","20190910","Geen verstrekking in Open Data","41780","Nee","177","1205",,,"2000",,"5","4","0","0",,"540","196","N1",,,,"3040","F7-SA",,"e4*2007/46*0387*12","D118","BDB6","0","0.05","350","Ja","Nee",,"Nee","5040","0","0.00","2024","Logisch","00","Nee","2024-09-10T00:00:00.000",,"2019-09-10T00:00:00.000","2019-09-10T00:00:00.000",,,,,,,,,,,,,,,,,,,,,,,,,,,,"https://opendata.rdw.nl/resource/3huj-srit.json","https://opendata.rdw.nl/resource/8ys7-d773.json","https://opendata.rdw.nl/resource/vezc-m2t6.json","https://opendata.rdw.nl/resource/jhie-znh9.json","https://opendata.rdw.nl/resource/kmfi-hrps.json"
"VD164J","Bedrijfsauto","OPEL","VIVARO BUSINESSVAN","20231011",,"9323","gesloten opbouw","5","N.v.t.","N.v.t.","4","1995","1843","3030","1943","750",,"20130423","20130423","Geen verstrekking in Open Data","38429","Nee",,"1187",,"2000","2000",,"0","4","0","0",,"518","190","N1",,,"r. balk a. vooras","3030","F7-SA",,"e4*2007/46*0387*02","B0BE","D1D5","0","0.03","350","Ja","Nee",,"Nee","5030","0","0.00","2023","Niet geregistreerd","NG","Nee","2023-10-11T00:00:00.000",,"2013-04-23T00:00:00.000","2013-04-23T00:00:00.000",,"0",,,,,,,,,,,,,,,,,,,,,,,,,,"https://opendata.rdw.nl/resource/3huj-srit.json","https://opendata.rdw.nl/resource/8ys7-d773.json","https://opendata.rdw.nl/resource/vezc-m2t6.json","https://opendata.rdw.nl/resource/jhie-znh9.json","https://opendata.rdw.nl/resource/kmfi-hrps.json"
"VD166J","Bedrijfsauto","OPEL","VIVARO BUSINESSVAN","20240509",,"9323","gesloten opbouw","5","N.v.t.","N.v.t.","4","1995","1843","3030","1943","750",,"20130423","20130423","Geen verstrekking in Open Data","38429","Nee",,"1187",,"2000","2000",,"0","4","0","0",,"518","190","N1",,,"r. balk a. vooras","3030","F7-SA",,"e4*2007/46*0387*02","B0BE","D1D5","0","0.03","350","Ja","Nee",,"Nee","5030","0","0.00","2023","Onlogisch","04","Nee","2024-05-09T00:00:00.000",,"2013-04-23T00:00:00.000","2013-04-23T00:00:00.000",,"0",,,,,,,,,,,,,,,,,,,,,,,,,,"https://opendata.rdw.nl/resource/3huj-srit.json","https://opendata.rdw.nl/resource/8ys7-d773.json","https://opendata.rdw.nl/resource/vezc-m2t6.json","https://opendata.rdw.nl/resource/jhie-znh9.json","https://opendata.rdw.nl/resource/kmfi-hrps.json"
"VD469L","Bedrijfsauto","OPEL","VIVARO BUSINESSVAN","20240303",,"7739","gesloten opbouw","6","N.v.t.","N.v.t.","4","1995","1843","3030","1943","750",,"20130506","20130506","Geen verstrekking in Open Data","32229","Nee",,"1187",,"2000","2000",,"0","4","0","0",,"518","190","N1",,,"r. balk a. vooras","3030","F7-SA",,"e4*2007/46*0387*02","B0BE","D1D6","0","0.03","350","Ja","Nee",,"Nee","5030","0","0.00","2023","Logisch","00","Nee","2024-03-03T00:00:00.000",,"2013-05-06T00:00:00.000","2013-05-06T00:00:00.000",,"0",,,,,,,,,,,,,,,,,,,,,,,,,,"https://opendata.rdw.nl/resource/3huj-srit.json","https://opendata.rdw.nl/resource/8ys7-d773.json","https://opendata.rdw.nl/resource/vezc-m2t6.json","https://opendata.rdw.nl/resource/jhie-znh9.json","https://opendata.rdw.nl/resource/kmfi-hrps.json"
"VD544R","Bedrijfsauto","OPEL","VIVARO BUSINESSVAN","20240207",,"10247","gesloten opbouw","5","N.v.t.","N.v.t.","4","1995","1901","3030","2001","750",,"20130529","20130529","Geen verstrekking in Open Data","42789","Nee",,"1129",,"2000","2000",,"0","4","0","0",,"518","190","N1",,,"r. balk a. vooras","3030","F7-SA",,"e4*2007/46*0387*02","B1BE","D1D5","0","0.04","350","Ja","Nee",,"Nee","5030","0","0.00","2023","Logisch","00","Nee","2024-02-07T00:00:00.000",,"2013-05-29T00:00:00.000","2013-05-29T00:00:00.000",,"0",,,,,,,,,,,,,,,,,,,,,,,,,,"https://opendata.rdw.nl/resource/3huj-srit.json","https://opendata.rdw.nl/resource/8ys7-d773.json","https://opendata.rdw.nl/resource/vezc-m2t6.json","https://opendata.rdw.nl/resource/jhie-znh9.json","https://opendata.rdw.nl/resource/kmfi-hrps.json"
"VD714R","Bedrijfsauto","OPEL","VIVARO BUSINESSVAN","20230927",,"10608","gesloten opbouw","5","N.v.t.","N.v.t.","4","1995","1901","3030","2001","750",,"20130529","20130529","Geen verstrekking in Open Data","44306","Nee",,"1129",,"2000","2000",,"0","4","0","0",,"518","190","N1",,,"r. balk a. vooras","3030","F7-SA",,"e4*2007/46*0387*02","B1BE","D1D5","0","0.04","350","Ja","Nee",,"Nee","5030","0","0.00","2022","Logisch","00","Nee","2023-09-27T00:00:00.000",,"2013-05-29T00:00:00.000","2013-05-29T00:00:00.000",,"0",,,,,,,,,,,,,,,,,,,,,,,,,,"https://opendata.rdw.nl/resource/3huj-srit.json","https://opendata.rdw.nl/resource/8ys7-d773.json","https://opendata.rdw.nl/resource/vezc-m2t6.json","https://opendata.rdw.nl/resource/jhie-znh9.json","https://opendata.rdw.nl/resource/kmfi-hrps.json"
"VD740V","Bedrijfsauto","OPEL","VIVARO BUSINESSVAN","20240830",,"9807","gesloten opbouw","5","N.v.t.","N.v.t.","4","1995","1901","3030","2001","750",,"20130614","20130614","Geen verstrekking in Open Data","40468","Nee",,"1129",,"2000","2000",,"0","4","0","0",,"518","190","N1",,,"r. balk a. vooras","3030","F7-SA",,"e4*2007/46*0387*02","B1BE","D1D5","0","0.04","350","Ja","Nee",,"Nee","5030","0","0.00","2023","Logisch","00","Nee","2024-08-30T00:00:00.000",,"2013-06-14T00:00:00.000","2013-06-14T00:00:00.000",,"0",,,,,,,,,,,,,,,,,,,,,,,,,,"https://opendata.rdw.nl/resource/3huj-srit.json","https://opendata.rdw.nl/resource/8ys7-d773.json","https://opendata.rdw.nl/resource/vezc-m2t6.json","https://opendata.rdw.nl/resource/jhie-znh9.json","https://opendata.rdw.nl/resource/kmfi-hrps.json"
"VF321N","Bedrijfsauto","OPEL","VIVARO BUSINESSVAN","20231011",,"10241","gesloten opbouw","6","N.v.t.","N.v.t.","4","1995","1843","3030","1943","750",,"20130906","20130906","Geen verstrekking in Open Data","42293","Nee",,"1187",,"2000","2000",,"0","4","0","0",,"518","190","N1",,,"r. balk a. vooras","3030","F7-SA",,"e4*2007/46*0387*02","B1B6","D1G6","0","0.04","350","Ja","Nee",,"Nee","5030","0",,"2023","Logisch","00","Nee","2023-10-11T00:00:00.000",,"2013-09-06T00:00:00.000","2013-09-06T00:00:00.000",,"0",,,,,,,,,,,,,,,,,,,,,,,,,,"https://opendata.rdw.nl/resource/3huj-srit.json","https://opendata.rdw.nl/resource/8ys7-d773.json","https://opendata.rdw.nl/resource/vezc-m2t6.json","https://opendata.rdw.nl/resource/jhie-znh9.json","https://opendata.rdw.nl/resource/kmfi-hrps.json"
"VF625V","Bedrijfsauto","OPEL","VIVARO BUSINESSVAN","20220613",,"11853","gesloten opbouw","6","N.v.t.","N.v.t.","4","1995","1901","3030","2001","750",,"20131015","20131015","Geen verstrekking in Open Data","49078","Nee",,"1129",,"2000","2000",,"0","4","0","0",,"518","190","N1",,,"r. balk a. vooras","3030","F7-SA",,"e4*2007/46*0387*02","B1BF","D1D6","0","0.04","350","Ja","Nee",,"Nee","5030","0",,"2022","Logisch","00","Nee","2022-06-13T00:00:00.000",,"2013-10-15T00:00:00.000","2013-10-15T00:00:00.000",,"0",,,,,,,,,,,,,,,,,,,,,,,,,,"https://opendata.rdw.nl/resource/3huj-srit.json","https://opendata.rdw.nl/resource/8ys7-d773.json","https://opendata.rdw.nl/resource/vezc-m2t6.json","https://opendata.rdw.nl/resource/jhie-znh9.json","https://opendata.rdw.nl/resource/kmfi-hrps.json"
"VF654H","Bedrijfsauto","OPEL","VIVARO BUSINESSVAN","20221212",,"8997","gesloten opbouw","6","N.v.t.","N.v.t.","4","1995","1843","3030","1943","750",,"20130809","20130809","Geen verstrekking in Open Data","37056","Nee",,"1187",,"2000","2000",,"0","4","0","0",,"518","190","N1",,,"r. balk a. vooras","3030","F7-SA",,"e4*2007/46*0387*02","B0B6","D1G6","0","0.03","350","Ja","Nee",,"Nee","5030","0",,"2023","Logisch","00","Nee","2022-12-12T00:00:00.000",,"2013-08-09T00:00:00.000","2013-08-09T00:00:00.000",,"0",,,,,,,,,,,,,,,,,,,,,,,,,,"https://opendata.rdw.nl/resource/3huj-srit.json","https://opendata.rdw.nl/resource/8ys7-d773.json","https://opendata.rdw.nl/resource/vezc-m2t6.json","https://opendata.rdw.nl/resource/jhie-znh9.json","https://opendata.rdw.nl/resource/kmfi-hrps.json"
"VF938K","Bedrijfsauto","OPEL","VIVARO BUSINESSVAN","20230824",,"10116","gesloten opbouw","6","N.v.t.","N.v.t.","4","1995","1901","3030","2001","750",,"20130816","20130816","Geen verstrekking in Open Data","41769","Nee",,"1129",,"2000","2000",,"0","4","0","0",,"518","190","N1",,,"r. balk a. vooras","3030","F7-SA",,"e4*2007/46*0387*02","B1BE","D1D6","0","0.04","350","Ja","Nee",,"Nee","5030","0","0.00","2023","Logisch","00","Nee","2023-08-24T00:00:00.000",,"2013-08-16T00:00:00.000","2013-08-16T00:00:00.000",,"0",,,,,,,,,,,,,,,,,,,,,,,,,,"https://opendata.rdw.nl/resource/3huj-srit.json","https://opendata.rdw.nl/resource/8ys7-d773.json","https://opendata.rdw.nl/resource/vezc-m2t6.json","https://opendata.rdw.nl/resource/jhie-znh9.json","https://opendata.rdw.nl/resource/kmfi-hrps.json"
"VG050D","Bedrijfsauto","OPEL","VIVARO BUSINESSVAN","20241108","20240209","9351","gesloten opbouw","5","N.v.t.","N.v.t.","4","1995","1901","3030","2001","750",,"20131108","20131108","Geen verstrekking in Open Data","39244","Nee",,"1129",,"2000","2000",,"0","4","0","0",,"518","190","N1",,,"r. balk a. vooras","3030","F7-SA",,"e4*2007/46*0387*02","B1BE","D1D5","0","0.04","350","Ja","Nee",,"Nee","5030","0","0.00","2024","Logisch","00","Nee","2024-11-08T00:00:00.000","2024-02-09T00:00:00.000","2013-11-08T00:00:00.000","2013-11-08T00:00:00.000",,"0",,,,,,,,,,,,,,,,,,,,,,,,,,"https://opendata.rdw.nl/resource/3huj-srit.json","https://opendata.rdw.nl/resource/8ys7-d773.json","https://opendata.rdw.nl/resource/vezc-m2t6.json","https://opendata.rdw.nl/resource/jhie-znh9.json","https://opendata.rdw.nl/resource/kmfi-hrps.json"
"VG265D","Bedrijfsauto","OPEL","VIVARO BUSINESSVAN","20240710",,"10354","gesloten opbouw","5","N.v.t.","N.v.t.","4","1995","1901","3030","2001","750",,"20131031","20131031","Geen verstrekking in Open Data","42769","Ja",,"1129",,"2000","2000",,"0","4","0","0",,"518","190","N1",,,"r. balk a. vooras","3030","F7-SA",,"e4*2007/46*0387*02","B1BE","D1D5","0","0.04","350","Ja","Nee",,"Nee","5030","0","0.00","2023","Onlogisch","04","Nee","2024-07-10T00:00:00.000",,"2013-10-31T00:00:00.000","2013-10-31T00:00:00.000",,"0",,,,,,,,,,,,,,,,,,,,,,,,,,"https://opendata.rdw.nl/resource/3huj-srit.json","https://opendata.rdw.nl/resource/8ys7-d773.json","https://opendata.rdw.nl/resource/vezc-m2t6.json","https://opendata.rdw.nl/resource/jhie-znh9.json","https://opendata.rdw.nl/resource/kmfi-hrps.json"
"VG375Z","Bedrijfsauto","OPEL","VIVARO BUSINESSVAN","20221228",,"8899","gesloten opbouw","6","N.v.t.","N.v.t.","4","1995","1816","2790","1916","750",,"20140124","20140124","Geen verstrekking in Open Data","36886","Nee",,"974",,,"2000",,"0","4","0","0",,"478","190","N1",,,"r. balk a. vooras","2790","F7-SA",,"e4*2007/46*0387*03","A0A8","B1G6","0","0.03","310","Ja","Nee",,"Nee","4790","0","0.00","2023","Logisch","00","Nee","2022-12-28T00:00:00.000",,"2014-01-24T00:00:00.000","2014-01-24T00:00:00.000",,"0",,,,,,,,,,,,,,,,,,,,,,,,,,"https://opendata.rdw.nl/resource/3huj-srit.json","https://opendata.rdw.nl/resource/8ys7-d773.json","https://opendata.rdw.nl/resource/vezc-m2t6.json","https://opendata.rdw.nl/resource/jhie-znh9.json","https://opendata.rdw.nl/resource/kmfi-hrps.json"
"VG443J","Bedrijfsauto","OPEL","VIVARO BUSINESSVAN","20240108",,"8313","gesloten opbouw","5","N.v.t.","N.v.t.","4","1995","1843","3030","1943","750",,"20131128","20131128","Geen verstrekking in Open Data","34176","Nee",,"1187",,"2000","2000",,"0","4","0","0",,"518","190","N1",,,"r. balk a. vooras","3030","F7-SA",,"e4*2007/46*0387*03","B0B1","D1G5","0","0.03","350","Ja","Nee",,"Nee","5030","0",,"2023","Logisch","00","Nee","2024-01-08T00:00:00.000",,"2013-11-28T00:00:00.000","2013-11-28T00:00:00.000",,"0",,,,,,,,,,,,,,,,,,,,,,,,,,"https://opendata.rdw.nl/resource/3huj-srit.json","https://opendata.rdw.nl/resource/8ys7-d773.json","https://opendata.rdw.nl/resource/vezc-m2t6.json","https://opendata.rdw.nl/resource/jhie-znh9.json","https://opendata.rdw.nl/resource/kmfi-hrps.json"
"VG479Z","Bedrijfsauto","OPEL","VIVARO BUSINESSVAN","20241123","20221210","9888","gesloten opbouw","5","N.v.t.","N.v.t.","4","1995","1901","3030","2001","750",,"20140125","20140125","Geen verstrekking in Open Data","40809","Ja",,"1129",,,"2000",,"0","4","0","0",,"518","190","N1",,,"r. balk a. vooras","3030","F7-SA",,"e4*2007/46*0387*03","B1B1","D1G5","0","0.04","350","Ja","Nee",,"Nee","5030","0",,"2024","Logisch","00","Nee","2024-11-23T00:00:00.000","2022-12-10T00:00:00.000","2014-01-25T00:00:00.000","2014-01-25T00:00:00.000",,"0",,,,,,,,,,,,,,,,,,,,,,,,,,"https://opendata.rdw.nl/resource/3huj-srit.json","https://opendata.rdw.nl/resource/8ys7-d773.json","https://opendata.rdw.nl/resource/vezc-m2t6.json","https://opendata.rdw.nl/resource/jhie-znh9.json","https://opendata.rdw.nl/resource/kmfi-hrps.json"
"VG669S","Bedrijfsauto","OPEL","VIVARO BUSINESSVAN","20240104",,"10137","gesloten opbouw","5","N.v.t.","N.v.t.","4","1995","1931","3030","2031","750",,"20140104","20140104","Geen verstrekking in Open Data","42323","Nee",,"1099",,"2000","2000",,"0","4","0","0",,"518","190","N1",,,"r. balk a. vooras","3030","F7-SA",,"e4*2007/46*0387*03","B1B8","D1D5","0","0.04","350","Ja","Nee",,"Nee","5030","0","0.00","2023","Logisch","00","Nee","2024-01-04T00:00:00.000",,"2014-01-04T00:00:00.000","2014-01-04T00:00:00.000",,"0",,,,,,,,,,,,,,,,,,,,,,,,,,"https://opendata.rdw.nl/resource/3huj-srit.json","https://opendata.rdw.nl/resource/8ys7-d773.json","https://opendata.rdw.nl/resource/vezc-m2t6.json","https://opendata.rdw.nl/resource/jhie-znh9.json","https://opendata.rdw.nl/resource/kmfi-hrps.json"
"VH066Z","Bedrijfsauto","OPEL","VIVARO BUSINESSVAN","20230704",,"9298","gesloten opbouw","6","N.v.t.","N.v.t.","4","1995","1823","3030","1923","750",,"20140424","20140424","Geen verstrekking in Open Data","38325","Nee",,"1207",,,"2000",,"0","4","0","0",,"518","190","N1",,,"r. balk a. vooras","3030","F7-SA",,"e4*2007/46*0387*04","B1B1","D1G6","0","0.04","350","Ja","Nee",,"Nee","5030","0",,"2023","Logisch","00","Nee","2023-07-04T00:00:00.000",,"2014-04-24T00:00:00.000","2014-04-24T00:00:00.000",,"0",,,,,,,,,,,,,,,,,,,,,,,,,,"https://opendata.rdw.nl/resource/3huj-srit.json","https://opendata.rdw.nl/resource/8ys7-d773.json","https://opendata.rdw.nl/resource/vezc-m2t6.json","https://opendata.rdw.nl/resource/jhie-znh9.json","https://opendata.rdw.nl/resource/kmfi-hrps.json"
"VH067Z","Bedrijfsauto","OPEL","VIVARO BUSINESSVAN","20240424","20240507","9298","gesloten opbouw","6","N.v.t.","N.v.t.","4","1995","1823","3030","1923","750",,"20140424","20140424","Geen verstrekking in Open Data","38325","Ja",,"1207",,,"2000",,"0","4","0","0",,"518","190","N1",,,"r. balk a. vooras","3030","F7-SA",,"e4*2007/46*0387*04","B1B1","D1G6","0","0.04","350","Ja","Nee",,"Nee","5030","0",,"2024","Logisch","00","Nee","2024-04-24T00:00:00.000","2024-05-07T00:00:00.000","2014-04-24T00:00:00.000","2014-04-24T00:00:00.000",,"0",,,,,,,,,,,,,,,,,,,,,,,,,,"https://opendata.rdw.nl/resource/3huj-srit.json","https://opendata.rdw.nl/resource/8ys7-d773.json","https://opendata.rdw.nl/resource/vezc-m2t6.json","https://opendata.rdw.nl/resource/jhie-znh9.json","https://opendata.rdw.nl/resource/kmfi-hrps.json"
"VH123B","Bedrijfsauto","OPEL","VIVARO BUSINESSVAN","20240414","20240202","10688","gesloten opbouw","5","N.v.t.","N.v.t.","4","1995","1953","3030","2053","750",,"20140128","20140128","Geen verstrekking in Open Data","44174","Ja",,"1077",,,"2000",,"0","4","0","0",,"518","190","N1",,,"r. balk a. vooras","3030","F7-SA",,"e4*2007/46*0387*03","B1B8","D1D5","0","0.04","350","Ja","Nee",,"Nee","5030","0","0.00","2024","Logisch","00","Nee","2024-04-14T00:00:00.000","2024-02-02T00:00:00.000","2014-01-28T00:00:00.000","2014-01-28T00:00:00.000",,"0",,,,,,,,,,,,,,,,,,,,,,,,,,"https://opendata.rdw.nl/resource/3huj-srit.json","https://opendata.rdw.nl/resource/8ys7-d773.json","https://opendata.rdw.nl/resource/vezc-m2t6.json","https://opendata.rdw.nl/resource/jhie-znh9.json","https://opendata.rdw.nl/resource/kmfi-hrps.json"
"VJ031P","Bedrijfsauto","OPEL","VIVARO BUSINESSVAN","20230630",,"9436","gesloten opbouw","6","N.v.t.","N.v.t.","4","1995","1823","3030","1923","750",,"20140630","20140630","Geen verstrekking in Open Data","38905","Nee",,"1207",,,"2000",,"0","4","0","0",,"518","190","N1",,,"r. balk a. vooras","3030","F7-SA",,"e4*2007/46*0387*04","B1B8","D1D6","0","0.04","350","Ja","Nee",,"Nee","5030","0","0.00","2022","Logisch","00","Nee","2023-06-30T00:00:00.000",,"2014-06-30T00:00:00.000","2014-06-30T00:00:00.000",,"0",,,,,,,,,,,,,,,,,,,,,,,,,,"https://opendata.rdw.nl/resource/3huj-srit.json","https://opendata.rdw.nl/resource/8ys7-d773.json","https://opendata.rdw.nl/resource/vezc-m2t6.json","https://opendata.rdw.nl/resource/jhie-znh9.json","https://opendata.rdw.nl/resource/kmfi-hrps.json"