"kenteken","voertuigsoort","merk","handelsbenaming","vervaldatum_apk","datum_tenaamstelling","bruto_bpm","inrichting","aantal_zitplaatsen","eerste_kleur","tweede_kleur","aantal_cilinders","cilinderinhoud","massa_ledig_voertuig","toegestane_maximum_massa_voertuig","massa_rijklaar","maximum_massa_trekken_ongeremd","maximum_trekken_massa_geremd","datum_eerste_toelating","datum_eerste_tenaamstelling_in_nederland","wacht_op_keuren","catalogusprijs","wam_verzekerd","maximale_constructiesnelheid","laadvermogen","oplegger_geremd","aanhangwagen_autonoom_geremd","aanhangwagen_middenas_geremd","aantal_staanplaatsen","aantal_deuren","aantal_wielen","afstand_hart_koppeling_tot_achterzijde_voertuig","afstand_voorzijde_voertuig_tot_hart_koppeling","afwijkende_maximum_snelheid","lengte","breedte","europese_voertuigcategorie","europese_voertuigcategorie_toevoeging","europese_uitvoeringcategorie_toevoeging","plaats_chassisnummer","technische_max_massa_voertuig","type","type_gasinstallatie","typegoedkeuringsnummer","variant","uitvoering","volgnummer_wijziging_eu_typegoedkeuring","vermogen_massarijklaar","wielbasis","export_indicator","openstaande_terugroepactie_indicator","vervaldatum_tachograaf","taxi_indicator","maximum_massa_samenstelling","aantal_rolstoelplaatsen","maximum_ondersteunende_snelheid","jaar_laatste_registratie_tellerstand","tellerstandoordeel","code_toelichting_tellerstandoordeel","tenaamstellen_mogelijk","vervaldatum_apk_dt","datum_tenaamstelling_dt","datum_eerste_toelating_dt","datum_eerste_tenaamstelling_in_nederland_dt","vervaldatum_tachograaf_dt","maximum_last_onder_de_vooras_sen_tezamen_koppeling","type_remsysteem_voertuig_code","rupsonderstelconfiguratiecode","wielbasis_voertuig_minimum","wielbasis_voertuig_maximum","lengte_voertuig_minimum","lengte_voertuig_maximum","breedte_voertuig_minimum","breedte_voertuig_maximum","hoogte_voertuig","hoogte_voertuig_minimum","hoogte_voertuig_maximum","massa_bedrijfsklaar_minimaal","massa_bedrijfsklaar_maximaal","technisch_toelaatbaar_massa_koppelpunt","maximum_massa_technisch_maximaal","maximum_massa_technisch_minimaal","subcategorie_nederland","verticale_belasting_koppelpunt_getrokken_voertuig","zuinigheidsclassificatie","registratie_datum_goedkeuring_afschrijvingsmoment_bpm","registratie_datum_goedkeuring_afschrijvingsmoment_bpm_dt","gem_lading_wrde","aerodyn_voorz","massa_alt_aandr","verl_cab_ind","api_gekentekende_voertuigen_assen","api_gekentekende_voertuigen_brandstof","api_gekentekende_voertuigen_carrosserie","api_gekentekende_voertuigen_carrosserie_specifiek","api_gekentekende_voertuigen_voertuigklasse"
"G121DK","Personenauto","MERCEDES-BENZ","SLC 180","20241004",,"5860","cabriolet","2","GRIJS","Niet geregistreerd","4","1595","1360","1775","1460",,,"20160609","20190920","Geen verstrekking in Open Data","44279","Nee","223",,,,,,"2","4","0","0",,"0","0","M1",,,"r. voorzitting","1775","172",,"e1*2007/46*0548*10","K431Q0","CZBB1222","0","0.08","243","Ja","Ja",,"Nee","0","0","0.00","2023","Geen oordeel","05","Nee","2024-10-04T00:00:00.000",,"2016-06-09T00:00:00.000","2019-09-20T00:00:00.000",,,,,,,,,,,,,,,,,,,,,"D","20231004","2023-10-04T00:00:00.000",,,,,"https://opendata.rdw.nl/resource/3huj-srit.json","https://opendata.rdw.nl/resource/8ys7-d773.json","https://opendata.rdw.nl/resource/vezc-m2t6.json","https://opendata.rdw.nl/resource/jhie-znh9.json","https://opendata.rdw.nl/resource/kmfi-hrps.json"
"K354JN","Personenauto","MERCEDES-BENZ","C 180","20240204",,"3931","cabriolet","4","BRUIN","Niet geregistreerd","4","1595","1500","2080","1600",,,"20170412","20210125","Geen verstrekking in Open Data","55272","Nee","222",,,,,,"2","4","0","0",,"0","0","M1",,,,"2080","204",,"e1*2001/116*0431*39","R431Q0","BZAA1461","0","0.07","284","Ja","Ja",,"Nee","0","0","0.00","2022","Geen oordeel","05","Nee","2024-02-04T00:00:00.000",,"2017-04-12T00:00:00.000","2021-01-25T00:00:00.000",,,,,,,,,,,,,,,,,,,,,"C",,,,,,,"https://opendata.rdw.nl/resource/3huj-srit.json","https://opendata.rdw.nl/resource/8ys7-d773.json","https://opendata.rdw.nl/resource/vezc-m2t6.json","https://opendata.rdw.nl/resource/jhie-znh9.json","https://opendata.rdw.nl/resource/kmfi-hrps.json"
"L192DB","Personenauto","MERCEDES-BENZ","SLC 180",,,"6920","cabriolet","2","BLAUW","Niet geregistreerd","4","1595","1360","1775","1460",,,"20180326","20210712","Geen verstrekking in Open Data","54259","Nee","223",,,,,,"2","4","0","0",,"0","0","M1",,,,"1775","172",,"e1*2007/46*0548*12","K431Q0","CZBA1212","0","0.08","243","Ja","Nee",,"Nee","0","0","0.00","2023","Geen oordeel","05","Nee",,,"2018-03-26T00:00:00.000","2021-07-12T00:00:00.000",,,,,,,,,,,,,,,,,,,,,,,,,,,,"https://opendata.rdw.nl/resource/3huj-srit.json","https://opendata.rdw.nl/resource/8ys7-d773.json","https://opendata.rdw.nl/resource/vezc-m2t6.json","https://opendata.rdw.nl/resource/jhie-znh9.json","https://opendata.rdw.nl/resource/kmfi-hrps.json"
"NH183S","Personenauto","MERCEDES-BENZ","C 180","20250420","20230422","8311","cabriolet","4","WIT","Niet geregistreerd","4","1595","1515","2095","1615","750","1800","20170203","20170203","Geen verstrekking in Open Data","62372","Ja",,,,,,,"2","4","0","0",,"476","188","M1",,,"onder r. voorzitting","2095","204",,"e1*2001/116*0431*41","R431Q0","CZAA1412","0","0.07","284","Ja","Nee",,"Nee","3965","0","0.00","2024","Onlogisch","04","Nee","2025-04-20T00:00:00.000","2023-04-22T00:00:00.000","2017-02-03T00:00:00.000","2017-02-03T00:00:00.000",,,,,,,,,,,"142",,,,,,,,,,"D",,,,,,,"https://opendata.rdw.nl/resource/3huj-srit.json","https://opendata.rdw.nl/resource/8ys7-d773.json","https://opendata.rdw.nl/resource/vezc-m2t6.json","https://opendata.rdw.nl/resource/jhie-znh9.json","https://opendata.rdw.nl/resource/kmfi-hrps.json"
"NK305K","Personenauto","MERCEDES-BENZ","C 180","20240318",,"7006","cabriolet","4","BLAUW","Niet geregistreerd","4","1595","1500","2080","1600","750","1400","20170224","20170224","Geen verstrekking in Open Data","60377","Nee",,,,,,,"2","4","0","0",,"476","188","M1",,,"onder r. voorzitting","2080","204",,"e1*2001/116*0431*42","R431Q0","BZAA1401","0","0.07","284","Ja","Nee",,"Nee","3550","0","0.00","2023","Logisch","00","Nee","2024-03-18T00:00:00.000",,"2017-02-24T00:00:00.000","2017-02-24T00:00:00.000",,,,,,,,,,,"142",,,,,,,,,,"C",,,,,,,"https://opendata.rdw.nl/resource/3huj-srit.json","https://opendata.rdw.nl/resource/8ys7-d773.json","https://opendata.rdw.nl/resource/vezc-m2t6.json","https://opendata.rdw.nl/resource/jhie-znh9.json","https://opendata.rdw.nl/resource/kmfi-hrps.json"
"NV098L","Personenauto","MERCEDES-BENZ","C 180","20230712",,"9036","cabriolet","4","ZWART","Niet geregistreerd","4","1595","1515","2095","1615","750","1800","20170428","20170428","Geen verstrekking in Open Data","65749","Nee",,,,,,,"2","4","0","0",,"476","188","M1",,,"onder r. voorzitting","2095","204",,"e1*2001/116*0431*39","R431Q0","CZAA1412","0","0.07","284","Ja","Nee",,"Nee","3965","0","0.00","2023","Onlogisch","04","Nee","2023-07-12T00:00:00.000",,"2017-04-28T00:00:00.000","2017-04-28T00:00:00.000",,,,,,,,,,,"142",,,,,,,,,,"D",,,,,,,"https://opendata.rdw.nl/resource/3huj-srit.json","https://opendata.rdw.nl/resource/8ys7-d773.json","https://opendata.rdw.nl/resource/vezc-m2t6.json","https://opendata.rdw.nl/resource/jhie-znh9.json","https://opendata.rdw.nl/resource/kmfi-hrps.json"
"P336DP","Personenauto","MERCEDES-BENZ","C 180",,,"8313","cabriolet","4","ZWART","Niet geregistreerd","4","1497","1590","2155","1690","750","1800","20210301","20220609","Geen verstrekking in Open Data","64366","Nee","220",,,,,,"2","4","0","0",,"0","0","M1",,,,"2155","204",,"e1*2001/116*0431*62","R47GT0","CLAA147A","1","0.07","284","Ja","Ja",,"Nee","4025","0","0.00","2022","Geen oordeel","05","Nee",,,"2021-03-01T00:00:00.000","2022-06-09T00:00:00.000",,,,,,,,,,,,,,,,,,,,,,"20220128","2022-01-28T00:00:00.000",,,,,"https://opendata.rdw.nl/resource/3huj-srit.json","https://opendata.rdw.nl/resource/8ys7-d773.json","https://opendata.rdw.nl/resource/vezc-m2t6.json","https://opendata.rdw.nl/resource/jhie-znh9.json","https://opendata.rdw.nl/resource/kmfi-hrps.json"
"RN188L","Personenauto","MERCEDES-BENZ","C 180","20231228",,"8311","cabriolet","4","ZWART","Niet geregistreerd","4","1595","1515","2095","1615","750","1800","20171228","20171228","Geen verstrekking in Open Data","69806","Nee",,,,,,,"2","4","0","0",,"476","188","M1",,,"onder r. voorzitting","2095","204",,"e1*2001/116*0431*42","R431Q0","CZAA1412","0","0.07","284","Ja","Nee",,"Nee","3965","0","0.00","2023","Logisch","00","Nee","2023-12-28T00:00:00.000",,"2017-12-28T00:00:00.000","2017-12-28T00:00:00.000",,,,,,,,,,,"142",,,,,,,,,,"D",,,,,,,"https://opendata.rdw.nl/resource/3huj-srit.json","https://opendata.rdw.nl/resource/8ys7-d773.json","https://opendata.rdw.nl/resource/vezc-m2t6.json","https://opendata.rdw.nl/resource/jhie-znh9.json","https://opendata.rdw.nl/resource/kmfi-hrps.json"
"RP820D","Personenauto","MERCEDES-BENZ","C 180","20231229",,"10133","cabriolet","4","GRIJS","Niet geregistreerd","4","1595","1515","2095","1615","750","1800","20171229","20171229","Geen verstrekking in Open Data","66036","Nee",,,,,,,"2","4","0","0",,"476","188","M1",,,"onder r. voorzitting","2095","204",,"e1*2001/116*0431*39","R431Q0","CZAA1414","0","0.07","284","Ja","Nee",,"Nee","3965","0","0.00","2023","Logisch","00","Nee","2023-12-29T00:00:00.000",,"2017-12-29T00:00:00.000","2017-12-29T00:00:00.000",,,,,,,,,,,"142",,,,,,,,,,"D",,,,,,,"https://opendata.rdw.nl/resource/3huj-srit.json","https://opendata.rdw.nl/resource/8ys7-d773.json","https://opendata.rdw.nl/resource/vezc-m2t6.json","https://opendata.rdw.nl/resource/jhie-znh9.json","https://opendata.rdw.nl/resource/kmfi-hrps.json"
"RT742H","Personenauto","MERCEDES-BENZ","SLC 180","20240601",,"6803","cabriolet","2","GRIJS","Niet geregistreerd","4","1595","1335","1750","1435",,,"20180131","20180131","Geen verstrekking in Open Data","58954","Nee",,,,,,,"2","4","0","0",,"0","0","M1",,,"in pers.ruimte a.","1750","172",,"e1*2007/46*0548*12","K431Q0","BZBA1222","0","0.08","243","Ja","Ja",,"Nee","0","0","0.00","2022","Logisch","00","Nee","2024-06-01T00:00:00.000",,"2018-01-31T00:00:00.000","2018-01-31T00:00:00.000",,,,,,,,,,,,,,,,,,,,,"D",,,,,,,"https://opendata.rdw.nl/resource/3huj-srit.json","https://opendata.rdw.nl/resource/8ys7-d773.json","https://opendata.rdw.nl/resource/vezc-m2t6.json","https://opendata.rdw.nl/resource/jhie-znh9.json","https://opendata.rdw.nl/resource/kmfi-hrps.json"
"SB975S","Personenauto","MERCEDES-BENZ","C 180","20260227","20240124","6475","cabriolet","4","ZWART","Niet geregistreerd","4","1595","1515","2095","1615","750","1800","20170627","20180329","Geen verstrekking in Open Data","70172","Nee",,,,,,,"2","4","0","0",,"0","0","M1",,,"op dwarsbalk v. r. voorzitting","2095","204",,"e1*2001/116*0431*44","R431Q0","CZAA1414","0","0.07","284","Ja","Ja",,"Nee","3965","0","0.00","2024","Geen oordeel","05","Nee","2026-02-27T00:00:00.000","2024-01-24T00:00:00.000","2017-06-27T00:00:00.000","2018-03-29T00:00:00.000",,,,,,,,,,,,,,,,,,,,,"D",,,,,,,"https://opendata.rdw.nl/resource/3huj-srit.json","https://opendata.rdw.nl/resource/8ys7-d773.json","https://opendata.rdw.nl/resource/vezc-m2t6.json","https://opendata.rdw.nl/resource/jhie-znh9.json","https://opendata.rdw.nl/resource/kmfi-hrps.json"
"SR094B","Personenauto","MERCEDES-BENZ","SLC 180","20240530",,"6803","cabriolet","2","ZWART","Niet geregistreerd","4","1595","1335","1750","1435",,,"20180523","20180523","Geen verstrekking in Open Data","49564","Nee",,,,,,,"2","4","0","0",,"415","182","M1",,,,"1750","172",,"e1*2007/46*0548*12","K431Q0","BZBA1212","0","0.08","243","Ja","Nee",,"Nee","0","0","0.00","2023","Logisch","00","Nee","2024-05-30T00:00:00.000",,"2018-05-23T00:00:00.000","2018-05-23T00:00:00.000",,,,,,,,,,,"131",,,,,,,,,,"D",,,,,,,"https://opendata.rdw.nl/resource/3huj-srit.json","https://opendata.rdw.nl/resource/8ys7-d773.json","https://opendata.rdw.nl/resource/vezc-m2t6.json","https://opendata.rdw.nl/resource/jhie-znh9.json","https://opendata.rdw.nl/resource/kmfi-hrps.json"
"TP861D","Personenauto","MERCEDES-BENZ","SLC 180","20240924",,"8471","cabriolet","2","ZWART","Niet geregistreerd","4","1595","1360","1775","1460",,,"20180924","20180924","Geen verstrekking in Open Data","50343","Nee",,,,,,,"2","4","0","0",,"415","182","M1",,,,"1775","172",,"e1*2007/46*0548*14","K431T0","CZBA121A","0","0.08","243","Ja","Nee",,"Nee","0","0","0.00","2023","Logisch","00","Nee","2024-09-24T00:00:00.000",,"2018-09-24T00:00:00.000","2018-09-24T00:00:00.000",,,,,,,,,,,"131",,,,,,,,,,,,,,,,,"https://opendata.rdw.nl/resource/3huj-srit.json","https://opendata.rdw.nl/resource/8ys7-d773.json","https://opendata.rdw.nl/resource/vezc-m2t6.json","https://opendata.rdw.nl/resource/jhie-znh9.json","https://opendata.rdw.nl/resource/kmfi-hrps.json"
"XH246D","Personenauto","MERCEDES-BENZ","SLC 180","20250201","20240311","8193","cabriolet","2","ZWART","Niet geregistreerd","4","1595","1360","1775","1460",,,"20190201","20190201","Geen verstrekking in Open Data","50573","Ja",,,,,,,"2","4","0","0",,"415","182","M1",,,,"1775","172",,"e1*2007/46*0548*15","K431T0","CZBA120A","0","0.08","243","Ja","Nee",,"Nee","0","0","0.00","2024","Logisch","00","Nee","2025-02-01T00:00:00.000","2024-03-11T00:00:00.000","2019-02-01T00:00:00.000","2019-02-01T00:00:00.000",,,,,,,,,,,"131",,,,,,,,,,,,,,,,,"https://opendata.rdw.nl/resource/3huj-srit.json","https://opendata.rdw.nl/resource/8ys7-d773.json","https://opendata.rdw.nl/resource/vezc-m2t6.json","https://opendata.rdw.nl/resource/jhie-znh9.json","https://opendata.rdw.nl/resource/kmfi-hrps.json"
"XK103H","Personenauto","MERCEDES-BENZ","SLC 180","20250124","20240403","6920","cabriolet","2","ZWART","Niet geregistreerd","4","1595","1360","1775","1460",,,"20190124","20190124","Geen verstrekking in Open Data","59253","Nee",,,,,,,"2","4","0","0",,"415","182","M1",,,,"1775","172",,"e1*2007/46*0548*12","K431Q0","CZBA1222","0","0.08","243","Ja","Nee",,"Nee","0","0","0.00","2024","Logisch","00","Nee","2025-01-24T00:00:00.000","2024-04-03T00:00:00.000","2019-01-24T00:00:00.000","2019-01-24T00:00:00.000",,,,,,,,,,,"131",,,,,,,,,,,,,,,,,"https://opendata.rdw.nl/resource/3huj-srit.json","https://opendata.rdw.nl/resource/8ys7-d773.json","https://opendata.rdw.nl/resource/vezc-m2t6.json","https://opendata.rdw.nl/resource/jhie-znh9.json","https://opendata.rdw.nl/resource/kmfi-hrps.json"
"XL692L","Personenauto","MERCEDES-BENZ","C 180",,,"12648","cabriolet","4","GRIJS","Niet geregistreerd","4","1595","1565","2130","1665","750","1800","20190204","20190204","Geen verstrekking in Open Data","72657","Nee",,,,,,,"2","4","0","0",,"475","188","M1",,,,"2130","204",,"e1*2001/116*0431*50","R431T0","CZAA047D","0","0.07","284","Ja","Nee",,"Nee","4000","0","0.00","2023","Logisch","00","Nee",,,"2019-02-04T00:00:00.000","2019-02-04T00:00:00.000",,,,,,,,,,,"141",,,,,,,,,,,,,,,,,"https://opendata.rdw.nl/resource/3huj-srit.json","https://opendata.rdw.nl/resource/8ys7-d773.json","https://opendata.rdw.nl/resource/vezc-m2t6.json","https://opendata.rdw.nl/resource/jhie-znh9.json","https://opendata.rdw.nl/resource/kmfi-hrps.json"
"XT717X","Personenauto","MERCEDES-BENZ","C 180","20240409",,"5921","cabriolet","4","ZWART","Niet geregistreerd","4","1595","1515","2095","1615","750","1800","20180409","20190507","Geen verstrekking in Open Data","63903","Nee",,,,,,,"2","4","0","0",,"0","0","M1",,,,"2095","204",,"e1*2001/116*0431*46","R431Q0","CZAA1472","0","0.07","284","Ja","Nee",,"Nee","3965","0","0.00","2023","Geen oordeel","05","Nee","2024-04-09T00:00:00.000",,"2018-04-09T00:00:00.000","2019-05-07T00:00:00.000",,,,,,,,,,,,,,,,,,,,,"D",,,,,,,"https://opendata.rdw.nl/resource/3huj-srit.json","https://opendata.rdw.nl/resource/8ys7-d773.json","https://opendata.rdw.nl/resource/vezc-m2t6.json","https://opendata.rdw.nl/resource/jhie-znh9.json","https://opendata.rdw.nl/resource/kmfi-hrps.json"
"ZR670L","Personenauto","MERCEDES-BENZ","C 180","20240804",,"12648","cabriolet","4","GRIJS","Niet geregistreerd","4","1595","1565","2130","1665","750","1800","20190720","20190720","Geen verstrekking in Open Data","79355","Nee","220",,,,,,"2","4","0","0",,"0","0","M1",,,,"2130","204",,"e1*2001/116*0431*48","R431T0","CZAZ047D","0","0.07","284","Ja","Nee",,"Nee","4000","0","0.00","2022","Logisch","00","Nee","2024-08-04T00:00:00.000",,"2019-07-20T00:00:00.000","2019-07-20T00:00:00.000",,,,,,,,,,,,,,,,,,,,,,,,,,,,"https://opendata.rdw.nl/resource/3huj-srit.json","https://opendata.rdw.nl/resource/8ys7-d773.json","https://opendata.rdw.nl/resource/vezc-m2t6.json","https://opendata.rdw.nl/resource/jhie-znh9.json","https://opendata.rdw.nl/resource/kmfi-hrps.json"
