"kenteken","voertuigsoort","merk","handelsbenaming","vervaldatum_apk","datum_tenaamstelling","bruto_bpm","inrichting","aantal_zitplaatsen","eerste_kleur","tweede_kleur","aantal_cilinders","cilinderinhoud","massa_ledig_voertuig","toegestane_maximum_massa_voertuig","massa_rijklaar","maximum_massa_trekken_ongeremd","maximum_trekken_massa_geremd","datum_eerste_toelating","datum_eerste_tenaamstelling_in_nederland","wacht_op_keuren","catalogusprijs","wam_verzekerd","maximale_constructiesnelheid","laadvermogen","oplegger_geremd","aanhangwagen_autonoom_geremd","aanhangwagen_middenas_geremd","aantal_staanplaatsen","aantal_deuren","aantal_wielen","afstand_hart_koppeling_tot_achterzijde_voertuig","afstand_voorzijde_voertuig_tot_hart_koppeling","afwijkende_maximum_snelheid","lengte","breedte","europese_voertuigcategorie","europese_voertuigcategorie_toevoeging","europese_uitvoeringcategorie_toevoeging","plaats_chassisnummer","technische_max_massa_voertuig","type","type_gasinstallatie","typegoedkeuringsnummer","variant","uitvoering","volgnummer_wijziging_eu_typegoedkeuring","vermogen_massarijklaar","wielbasis","export_indicator","openstaande_terugroepactie_indicator","vervaldatum_tachograaf","taxi_indicator","maximum_massa_samenstelling","aantal_rolstoelplaatsen","maximum_ondersteunende_snelheid","jaar_laatste_registratie_tellerstand","tellerstandoordeel","code_toelichting_tellerstandoordeel","tenaamstellen_mogelijk","vervaldatum_apk_dt","datum_tenaamstelling_dt","datum_eerste_toelating_dt","datum_eerste_tenaamstelling_in_nederland_dt","vervaldatum_tachograaf_dt","maximum_last_onder_de_vooras_sen_tezamen_koppeling","type_remsysteem_voertuig_code","rupsonderstelconfiguratiecode","wielbasis_voertuig_minimum","wielbasis_voertuig_maximum","lengte_voertuig_minimum","lengte_voertuig_maximum","breedte_voertuig_minimum","breedte_voertuig_maximum","hoogte_voertuig","hoogte_voertuig_minimum","hoogte_voertuig_maximum","massa_bedrijfsklaar_minimaal","massa_bedrijfsklaar_maximaal","technisch_toelaatbaar_massa_koppelpunt","maximum_massa_technisch_maximaal","maximum_massa_technisch_minimaal","subcategorie_nederland","verticale_belasting_koppelpunt_getrokken_voertuig","zuinigheidsclassificatie","registratie_datum_goedkeuring_afschrijvingsmoment_bpm","registratie_datum_goedkeuring_afschrijvingsmoment_bpm_dt","gem_lading_wrde","aerodyn_voorz","massa_alt_aandr","verl_cab_ind","api_gekentekende_voertuigen_assen","api_gekentekende_voertuigen_brandstof","api_gekentekende_voertuigen_carrosserie","api_gekentekende_voertuigen_carrosserie_specifiek","api_gekentekende_voertuigen_voertuigklasse"
"G680HD","Personenauto","MERCEDES-BENZ","GLA 200 D","20230102",,"2627","stationwagen","5","GRIJS","Niet geregistreerd","4","2143","1435","2020","1535","750","1500","20170102","20190923","Geen verstrekking in Open Data","51307","Nee","205",,,,,,"5","4","0","0",,"0","180","M1",,,"r. bodemplaat v. voorzitting","2020","245 G",,"e1*2001/116*0470*16","27S1P2","MZAA1501","0","0.07","270","Ja","Nee",,"Nee","3570","0","0.00","2022","Geen oordeel","05","Nee","2023-01-02T00:00:00.000",,"2017-01-02T00:00:00.000","2019-09-23T00:00:00.000",,,,,,,,,,,,,,,,,,,,,"E",,,,,,,"https://opendata.rdw.nl/resource/3huj-srit.json","https://opendata.rdw.nl/resource/8ys7-d773.json","https://opendata.rdw.nl/resource/vezc-m2t6.json","https://opendata.rdw.nl/resource/jhie-znh9.json","https://opendata.rdw.nl/resource/kmfi-hrps.json"
"H505BN","Personenauto","MERCEDES-BENZ","GLA 200 D","20240530","20240124","5011","stationwagen","5","ZWART","Niet geregistreerd","4","2143","1435","2020","1535","750","1500","20160822","20191230","Geen verstrekking in Open Data","50384","Ja","205",,,,,,"5","4","0","0",,"0","180","M1",,,"r. balk by voorzitting","2020","245 G",,"e1*2001/116*0470*16","27S1P2","MZAZ1501","0","0.07","270","Ja","Ja",,"Nee","3570","0","0.00","2024","Geen oordeel","05","Nee","2024-05-30T00:00:00.000","2024-01-24T00:00:00.000","2016-08-22T00:00:00.000","2019-12-30T00:00:00.000",,,,,,,,,,,,,,,,,,,,,"E",,,,,,,"https://opendata.rdw.nl/resource/3huj-srit.json","https://opendata.rdw.nl/resource/8ys7-d773.json","https://opendata.rdw.nl/resource/vezc-m2t6.json","https://opendata.rdw.nl/resource/jhie-znh9.json","https://opendata.rdw.nl/resource/kmfi-hrps.json"
"J580JT","Personenauto","MERCEDES-BENZ","GLA 200 D","20230831",,"718","stationwagen","5","WIT","Niet geregistreerd","4","2143","1435","2020","1535","750","1500","20151124","20200817","Geen verstrekking in Open Data","50236","Nee","205",,,,,,"5","4","0","0",,"0","180","M1",,,"by dwarsbalk r. voorzitting","2020","245 G",,"e1*2001/116*0470*15","27S1P2","MZAAA501","0","0.07","270","Ja","Nee",,"Nee","3570","0","0.00","2023","Onlogisch","04","Nee","2023-08-31T00:00:00.000",,"2015-11-24T00:00:00.000","2020-08-17T00:00:00.000",,,,,,,,,,,,,,,,,,,,,"C",,,,,,,"https://opendata.rdw.nl/resource/3huj-srit.json","https://opendata.rdw.nl/resource/8ys7-d773.json","https://opendata.rdw.nl/resource/vezc-m2t6.json","https://opendata.rdw.nl/resource/jhie-znh9.json","https://opendata.rdw.nl/resource/kmfi-hrps.json"
"J699GP","Personenauto","MERCEDES-BENZ","GLA 200 D","20230729",,"1311","stationwagen","5","GRIJS","Niet geregistreerd","4","2143","1405","2020","1505","750","1500","20160309","20200724","Geen verstrekking in Open Data","44054","Nee","205",,,,,,"5","4","0","0",,"0","180","M1",,,,"2020","245 G",,"e1*2001/116*0470*15","27S1P2","AZAAA502","0","0.07","270","Ja","Nee",,"Nee","3540","0","0.00","2023","Geen oordeel","05","Nee","2023-07-29T00:00:00.000",,"2016-03-09T00:00:00.000","2020-07-24T00:00:00.000",,,,,,,,,,,,,,,,,,,,,"E",,,,,,,"https://opendata.rdw.nl/resource/3huj-srit.json","https://opendata.rdw.nl/resource/8ys7-d773.json","https://opendata.rdw.nl/resource/vezc-m2t6.json","https://opendata.rdw.nl/resource/jhie-znh9.json","https://opendata.rdw.nl/resource/kmfi-hrps.json"
"K092PH","Personenauto","MERCEDES-BENZ","GLA 200 D",,,"2874","stationwagen","5","BRUIN","Niet geregistreerd","4","2143","1405","2020","1505","750","1500","20160912","20210122","Geen verstrekking in Open Data","44768","Nee","205",,,,,,"5","4","0","0",,"0","180","M1",,,,"2020","245 G",,"e1*2001/116*0470*16","27S1P2","AZAZ1501","0","0.07","270","Ja","Nee",,"Nee","3540","0","0.00","2022","Geen oordeel","05","Nee",,,"2016-09-12T00:00:00.000","2021-01-22T00:00:00.000",,,,,,,,,,,,,,,,,,,,,"E",,,,,,,"https://opendata.rdw.nl/resource/3huj-srit.json","https://opendata.rdw.nl/resource/8ys7-d773.json","https://opendata.rdw.nl/resource/vezc-m2t6.json","https://opendata.rdw.nl/resource/jhie-znh9.json","https://opendata.rdw.nl/resource/kmfi-hrps.json"
"K569ZD","Personenauto","MERCEDES-BENZ","GLA 200 D","20230530",,"2825","stationwagen","5","BLAUW","Niet geregistreerd","4","2143","1440","2035","1540","750","1500","20171123","20210329","Geen verstrekking in Open Data","43479","Nee","205",,,,,,"5","4","0","0",,"0","180","M1",,,,"2035","245 G",,"e1*2001/116*0470*18","27S1P2","MZAA1501","0","0.06","270","Ja","Nee",,"Nee","3575","0","0.00","2022","Geen oordeel","05","Nee","2023-05-30T00:00:00.000",,"2017-11-23T00:00:00.000","2021-03-29T00:00:00.000",,,,,,,,,,,,,,,,,,,,,"E",,,,,,,"https://opendata.rdw.nl/resource/3huj-srit.json","https://opendata.rdw.nl/resource/8ys7-d773.json","https://opendata.rdw.nl/resource/vezc-m2t6.json","https://opendata.rdw.nl/resource/jhie-znh9.json","https://opendata.rdw.nl/resource/kmfi-hrps.json"
"KH651L","Personenauto","MERCEDES-BENZ","GLA 200 D","20240330",,"3809","stationwagen","5","WIT","Niet geregistreerd","4","2143","1405","2020","1505","750","1500","20160316","20160906","Geen verstrekking in Open Data","44821","Nee",,,,,,,"5","4",,,,,,"M1",,,"r. bodemplaat by voorzitting","2020","245 G",,,,,,"0.07","270","Ja","Nee",,"Nee","3540",,,"2023","Onlogisch","04","Nee","2024-03-30T00:00:00.000",,"2016-03-16T00:00:00.000","2016-09-06T00:00:00.000",,,,,,,,,,,,,,,,,,,,,"E",,,,,,,"https://opendata.rdw.nl/resource/3huj-srit.json","https://opendata.rdw.nl/resource/8ys7-d773.json","https://opendata.rdw.nl/resource/vezc-m2t6.json","https://opendata.rdw.nl/resource/jhie-znh9.json","https://opendata.rdw.nl/resource/kmfi-hrps.json"
"KL205N","Personenauto","MERCEDES-BENZ","GLA 200 D","20231025",,"6303","stationwagen","5","WIT","Niet geregistreerd","4","2143","1435","2020","1535","750","1500","20161012","20161012","Geen verstrekking in Open Data","51829","Nee",,,,,,,"5","4","0","0",,"447","180","M1",,,"onder r. voorzitting","2020","245 G",,"e1*2001/116*0470*16","27S1P2","MZAA1501","0","0.07","270","Ja","Nee",,"Nee","3570","0","0.00","2022","Logisch","00","Nee","2023-10-25T00:00:00.000",,"2016-10-12T00:00:00.000","2016-10-12T00:00:00.000",,,,,,,,,,,"154",,,,,,,,,,"E",,,,,,,"https://opendata.rdw.nl/resource/3huj-srit.json","https://opendata.rdw.nl/resource/8ys7-d773.json","https://opendata.rdw.nl/resource/vezc-m2t6.json","https://opendata.rdw.nl/resource/jhie-znh9.json","https://opendata.rdw.nl/resource/kmfi-hrps.json"
"L016RF","Personenauto","MERCEDES-BENZ","GLA 200 D","20240711",,"2807","stationwagen","5","ZWART","Niet geregistreerd","4","2143","1440","2035","1540","750","1500","20170504","20210715","Geen verstrekking in Open Data","50880","Nee","205",,,,,,"5","4",,,,,"180","M1",,,,"2035","245 G",,"e1*2001/116*0470*17","27S1P2","MZAA1501","1","0.06","270","Ja","Ja",,"Nee","3575",,,"2023","Geen oordeel","05","Nee","2024-07-11T00:00:00.000",,"2017-05-04T00:00:00.000","2021-07-15T00:00:00.000",,,,,,,,,,,,,,,,,,,,,,,,,,,,"https://opendata.rdw.nl/resource/3huj-srit.json","https://opendata.rdw.nl/resource/8ys7-d773.json","https://opendata.rdw.nl/resource/vezc-m2t6.json","https://opendata.rdw.nl/resource/jhie-znh9.json","https://opendata.rdw.nl/resource/kmfi-hrps.json"
"L095NF","Personenauto","MERCEDES-BENZ","GLA 200 D","20230702",,"436","stationwagen","5","GRIJS","Niet geregistreerd","4","2143","1440","2035","1540","750","1500","20180215","20210621","Geen verstrekking in Open Data","48194","Nee","205",,,,,,"5","4","0","0",,"446","180","M1",,,"by dwarsbalk r. voorzitting","2035","245 G",,"e1*2001/116*0470*18","27S1P2","MZAA15A1","0","0.06","270","Ja","Ja",,"Nee","3575","0","0.00","2022","Geen oordeel","05","Nee","2023-07-02T00:00:00.000",,"2018-02-15T00:00:00.000","2021-06-21T00:00:00.000",,,,,,,,,,,"154",,,,,,,,,,,,,,,,,"https://opendata.rdw.nl/resource/3huj-srit.json","https://opendata.rdw.nl/resource/8ys7-d773.json","https://opendata.rdw.nl/resource/vezc-m2t6.json","https://opendata.rdw.nl/resource/jhie-znh9.json","https://opendata.rdw.nl/resource/kmfi-hrps.json"
"L388ZP","Personenauto","MERCEDES-BENZ","GLA 200 D",,,"9431","stationwagen","5","GRIJS","Niet geregistreerd","4","1950","1515","2135","1615","750","1800","20210409","20221121","Geen verstrekking in Open Data","60450","Nee","208",,,,,,"5","4","0","0",,"0","0","M1",,,,"2135","F2B",,"e1*2007/46*1909*09","OH1CT2","JZAA150A","0","0.07","273","Ja","Nee",,"Nee","4025","0","0.00","2022","Geen oordeel","05","Nee",,,"2021-04-09T00:00:00.000","2022-11-21T00:00:00.000",,,,,,,,,,,,,,,,,,,,,,,,,,,,"https://opendata.rdw.nl/resource/3huj-srit.json","https://opendata.rdw.nl/resource/8ys7-d773.json","https://opendata.rdw.nl/resource/vezc-m2t6.json","https://opendata.rdw.nl/resource/jhie-znh9.json","https://opendata.rdw.nl/resource/kmfi-hrps.json"
"L938NZ","Personenauto","MERCEDES-BENZ","GLA 200 D","20230811",,"1425","stationwagen","5","GRIJS","Niet geregistreerd","4","2143","1435","2020","1535","750","1500","20170510","20210628","Geen verstrekking in Open Data","49520","Nee","205",,,,,,"5","4","0","0",,"0","180","M1",,,,"2020","245 G",,"e1*2001/116*0470*16","27S1P2","MZAA1502","0","0.07","270","Ja","Ja",,"Nee","3570","0","0.00","2022","Geen oordeel","05","Nee","2023-08-11T00:00:00.000",,"2017-05-10T00:00:00.000","2021-06-28T00:00:00.000",,,,,,,,,,,,,,,,,,,,,,,,,,,,"https://opendata.rdw.nl/resource/3huj-srit.json","https://opendata.rdw.nl/resource/8ys7-d773.json","https://opendata.rdw.nl/resource/vezc-m2t6.json","https://opendata.rdw.nl/resource/jhie-znh9.json","https://opendata.rdw.nl/resource/kmfi-hrps.json"
"N527DN","Personenauto","MERCEDES-BENZ","GLA 200 D","20250219","20210922","6303","stationwagen","5","GRIJS","Niet geregistreerd","4","2143","1435","2020","1535","750","1500","20160315","20210922","Geen verstrekking in Open Data","43341","Nee","205",,,,,,"5","4","0","0",,"0","180","M1",,,,"2020","245 G",,"e1*2001/116*0470*15","27S1P2","MZAAA501","0","0.07","270","Ja","Nee",,"Nee","3570","0","0.00","2024","Niet geregistreerd","NG","Nee","2025-02-19T00:00:00.000","2021-09-22T00:00:00.000","2016-03-15T00:00:00.000","2021-09-22T00:00:00.000",,,,,,,,,,,,,,,,,,,,,,,,,,,,"https://opendata.rdw.nl/resource/3huj-srit.json","https://opendata.rdw.nl/resource/8ys7-d773.json","https://opendata.rdw.nl/resource/vezc-m2t6.json","https://opendata.rdw.nl/resource/jhie-znh9.json","https://opendata.rdw.nl/resource/kmfi-hrps.json"
"N703NN","Personenauto","MERCEDES-BENZ","GLA 200 D 4MATIC","20240106",,"1200","stationwagen","5","ZWART","Niet geregistreerd","4","2143","1495","2075","1595","750","1800","20151015","20211123","Geen verstrekking in Open Data","60996","Nee","200",,,,,,"5","4","0","0",,"0","180","M1",,,,"2075","245 G",,"e1*2001/116*0470*15","27S1P1","MZAAA502","0","0.06","270","Ja","Nee",,"Nee","3930","0","0.00","2023","Geen oordeel","05","Nee","2024-01-06T00:00:00.000",,"2015-10-15T00:00:00.000","2021-11-23T00:00:00.000",,,,,,,,,,,,,,,,,,,,,,"20211117","2021-11-17T00:00:00.000",,,,,"https://opendata.rdw.nl/resource/3huj-srit.json","https://opendata.rdw.nl/resource/8ys7-d773.json","https://opendata.rdw.nl/resource/vezc-m2t6.json","https://opendata.rdw.nl/resource/jhie-znh9.json","https://opendata.rdw.nl/resource/kmfi-hrps.json"
"P235ZR","Personenauto","MERCEDES-BENZ","GLA 200 D","20240225",,"5728","stationwagen","5","BRUIN","Niet geregistreerd","4","2143","1435","2020","1535","750","1500","20151027","20220706","Geen verstrekking in Open Data","50499","Nee","205",,,,,,"5","4","0","0",,"0","180","M1",,,,"2020","245 G",,"e1*2001/116*0470*15","27S1P2","MZAAA501","0","0.07","270","Ja","Nee",,"Nee","3570","0","0.00","2024","Geen oordeel","05","Nee","2024-02-25T00:00:00.000",,"2015-10-27T00:00:00.000","2022-07-06T00:00:00.000",,,,,,,,,,,,,,,,,,,,,,"20220705","2022-07-05T00:00:00.000",,,,,"https://opendata.rdw.nl/resource/3huj-srit.json","https://opendata.rdw.nl/resource/8ys7-d773.json","https://opendata.rdw.nl/resource/vezc-m2t6.json","https://opendata.rdw.nl/resource/jhie-znh9.json","https://opendata.rdw.nl/resource/kmfi-hrps.json"
"P524PL","Personenauto","MERCEDES-BENZ","GLA 200 D","20230616",,"8440","stationwagen","5","WIT","Niet geregistreerd","4","2143","1440","2035","1540","750","1500","20170619","20220517","Geen verstrekking in Open Data","51964","Nee","205",,,,,,"5","4","0","0",,"0","180","M1",,,,"2035","245 G",,"e1*2001/116*0470*18","27S1P2","MZAA15A2","0","0.06","270","Ja","Ja",,"Nee","3575","0","0.00","2023","Geen oordeel","05","Nee","2023-06-16T00:00:00.000",,"2017-06-19T00:00:00.000","2022-05-17T00:00:00.000",,,,,,,,,,,,,,,,,,,,,,"20220504","2022-05-04T00:00:00.000",,,,,"https://opendata.rdw.nl/resource/3huj-srit.json","https://opendata.rdw.nl/resource/8ys7-d773.json","https://opendata.rdw.nl/resource/vezc-m2t6.json","https://opendata.rdw.nl/resource/jhie-znh9.json","https://opendata.rdw.nl/resource/kmfi-hrps.json"
"PH884K","Personenauto","MERCEDES-BENZ","GLA 200 D","20240628",,"8440","stationwagen","5","GRIJS","Niet geregistreerd","4","2143","1440","2035","1540","750","1500","20170629","20170629","Geen verstrekking in Open Data","56210","Nee",,,,,,,"5","4","0","0",,"446","180","M1",,,"onder r. voorzitting","2035","245 G",,"e1*2001/116*0470*18","27S1P2","MZAA1502","0","0.06","270","Ja","Nee",,"Nee","3575","0","0.00","2023","Logisch","00","Nee","2024-06-28T00:00:00.000",,"2017-06-29T00:00:00.000","2017-06-29T00:00:00.000",,,,,,,,,,,"154",,,,,,,,,,"E",,,,,,,"https://opendata.rdw.nl/resource/3huj-srit.json","https://opendata.rdw.nl/resource/8ys7-d773.json","https://opendata.rdw.nl/resource/vezc-m2t6.json","https://opendata.rdw.nl/resource/jhie-znh9.json","https://opendata.rdw.nl/resource/kmfi-hrps.json"
"PK433S","Personenauto","MERCEDES-BENZ","GLA 200 D","20221020",,"6818","stationwagen","5","BLAUW","Niet geregistreerd","4","2143","1440","2035","1540","750","1500","20170719","20170719","Geen verstrekking in Open Data","45830","Nee",,,,,,,"5","4","0","0",,"446","180","M1",,,"onder r. voorzitting","2035","245 G",,"e1*2001/116*0470*18","27S1P2","MZAA1501","0","0.06","270","Ja","Nee",,"Nee","3575","0","0.00","2022","Logisch","00","Nee","2022-10-20T00:00:00.000",,"2017-07-19T00:00:00.000","2017-07-19T00:00:00.000",,,,,,,,,,,"154",,,,,,,,,,"E",,,,,,,"https://opendata.rdw.nl/resource/3huj-srit.json","https://opendata.rdw.nl/resource/8ys7-d773.json","https://opendata.rdw.nl/resource/vezc-m2t6.json","https://opendata.rdw.nl/resource/jhie-znh9.json","https://opendata.rdw.nl/resource/kmfi-hrps.json"
"PL223N","Personenauto","MERCEDES-BENZ","GLA 200 D","20230131",,"6818","stationwagen","5","WIT","Niet geregistreerd","4","2143","1440","2035","1540","750","1500","20170731","20170731","Geen verstrekking in Open Data","46975","Nee",,,,,,,"5","4","0","0",,"0","0","M1",,,"onder r. voorzitting","2035","245 G",,"e1*2001/116*0470*18","27S1P2","MZAA1501","0","0.06","270","Ja","Nee",,"Nee","3575","0","0.00","2022","Logisch","00","Nee","2023-01-31T00:00:00.000",,"2017-07-31T00:00:00.000","2017-07-31T00:00:00.000",,,,,,,,,,,,,,,,,,,,,"E",,,,,,,"https://opendata.rdw.nl/resource/3huj-srit.json","https://opendata.rdw.nl/resource/8ys7-d773.json","https://opendata.rdw.nl/resource/vezc-m2t6.json","https://opendata.rdw.nl/resource/jhie-znh9.json","https://opendata.rdw.nl/resource/kmfi-hrps.json"
"PT372K","Personenauto","MERCEDES-BENZ","GLA 200 D 4MATIC","20221023",,"6030","stationwagen","5","ZWART","Niet geregistreerd","4","2143","1495","2075","1595","750","1800","20161018","20170915","Geen verstrekking in Open Data","53982","Nee",,,,,,,"5","4","0","0",,"0","0","M1",,,"by dwarsbalk r. voorzitting","2075","245 G",,"e1*2001/116*0470*16","27S1P1","MZAA1502","0","0.06","270","Ja","Nee",,"Nee","3930","0","0.00","2022","Geen oordeel","05","Nee","2022-10-23T00:00:00.000",,"2016-10-18T00:00:00.000","2017-09-15T00:00:00.000",,,,,,,,,,,,,,,,,,,,,"G",,,,,,,"https://opendata.rdw.nl/resource/3huj-srit.json","https://opendata.rdw.nl/resource/8ys7-d773.json","https://opendata.rdw.nl/resource/vezc-m2t6.json","https://opendata.rdw.nl/resource/jhie-znh9.json","https://opendata.rdw.nl/resource/kmfi-hrps.json"
"PV164Z","Personenauto","MERCEDES-BENZ","GLA 200 D","20221004",,"8440","stationwagen","5","GRIJS","Niet geregistreerd","4","2143","1405","2035","1505","750","1500","20171004","20171004","Geen verstrekking in Open Data","48348","Nee",,,,,,,"5","4","0","0",,"0","0","M1",,,"onder r. voorzitting","2035","245 G",,"e1*2001/116*0470*18","27S1P2","AZAA15A2","0","0.07","270","Ja","Nee",,"Nee","3540","0","0.00","2022","Logisch","00","Nee","2022-10-04T00:00:00.000",,"2017-10-04T00:00:00.000","2017-10-04T00:00:00.000",,,,,,,,,,,,,,,,,,,,,"E",,,,,,,"https://opendata.rdw.nl/resource/3huj-srit.json","https://opendata.rdw.nl/resource/8ys7-d773.json","https://opendata.rdw.nl/resource/vezc-m2t6.json","https://opendata.rdw.nl/resource/jhie-znh9.json","https://opendata.rdw.nl/resource/kmfi-hrps.json"
"PV664L","Personenauto","MERCEDES-BENZ","GLA 200 D","20220929",,"8440","stationwagen","5","ZWART","Niet geregistreerd","4","2143","1440","2035","1540","750","1500","20170929","20170929","Geen verstrekking in Open Data","50840","Nee",,,,,,,"5","4","0","0",,"446","180","M1",,,"onder r. voorzitting","2035","245 G",,"e1*2001/116*0470*18","27S1P2","MZAA15A2","0","0.06","270","Ja","Nee",,"Nee","3575","0","0.00","2022","Logisch","00","Nee","2022-09-29T00:00:00.000",,"2017-09-29T00:00:00.000","2017-09-29T00:00:00.000",,,,,,,,,,,"154",,,,,,,,,,"E",,,,,,,"https://opendata.rdw.nl/resource/3huj-srit.json","https://opendata.rdw.nl/resource/8ys7-d773.json","https://opendata.rdw.nl/resource/vezc-m2t6.json","https://opendata.rdw.nl/resource/jhie-znh9.json","https://opendata.rdw.nl/resource/kmfi-hrps.json"
"PZ869K","Personenauto","MERCEDES-BENZ","GLA 200 D","20221018",,"7282","stationwagen","5","WIT","Niet geregistreerd","4","2143","1405","2035","1505","750","1500","20171018","20171018","Geen verstrekking in Open Data","42495","Nee",,,,,,,"5","4","0","0",,"0","0","M1",,,"onder r. voorzitting","2035","245 G",,"e1*2001/116*0470*18","27S1P2","AZAA1501","0","0.07","270","Ja","Nee",,"Nee","3540","0","0.00","2022","Logisch","00","Nee","2022-10-18T00:00:00.000",,"2017-10-18T00:00:00.000","2017-10-18T00:00:00.000",,,,,,,,,,,,,,,,,,,,,"E",,,,,,,"https://opendata.rdw.nl/resource/3huj-srit.json","https://opendata.rdw.nl/resource/8ys7-d773.json","https://opendata.rdw.nl/resource/vezc-m2t6.json","https://opendata.rdw.nl/resource/jhie-znh9.json","https://opendata.rdw.nl/resource/kmfi-hrps.json"
"RG121G","Personenauto","MERCEDES-BENZ","GLA 200 D","20231114",,"6818","stationwagen","5","ZWART","Niet geregistreerd","4","2143","1440","2035","1540","750","1500","20171114","20171114","Geen verstrekking in Open Data","43526","Nee",,,,,,,"5","4","0","0",,"446","180","M1",,,"onder r. voorzitting","2035","245 G",,"e1*2001/116*0470*18","27S1P2","MZAA1501","0","0.06","270","Ja","Nee",,"Nee","3575","0","0.00","2022","Logisch","00","Nee","2023-11-14T00:00:00.000",,"2017-11-14T00:00:00.000","2017-11-14T00:00:00.000",,,,,,,,,,,"154",,,,,,,,,,"E",,,,,,,"https://opendata.rdw.nl/resource/3huj-srit.json","https://opendata.rdw.nl/resource/8ys7-d773.json","https://opendata.rdw.nl/resource/vezc-m2t6.json","https://opendata.rdw.nl/resource/jhie-znh9.json","https://opendata.rdw.nl/resource/kmfi-hrps.json"
"RN263L","Personenauto","MERCEDES-BENZ","GLA 200 D","20240103",,"6818","stationwagen","5","BLAUW","Niet geregistreerd","4","2143","1440","2035","1540","750","1500","20180103","20180103","Geen verstrekking in Open Data","62296","Nee",,,,,,,"5","4","0","0",,"446","180","M1",,,"onder r. voorzitting","2035","245 G",,"e1*2001/116*0470*18","27S1P2","MZAA1501","0","0.06","270","Ja","Nee",,"Nee","3575","0","0.00","2023","Logisch","00","Nee","2024-01-03T00:00:00.000",,"2018-01-03T00:00:00.000","2018-01-03T00:00:00.000",,,,,,,,,,,"154",,,,,,,,,,"E",,,,,,,"https://opendata.rdw.nl/resource/3huj-srit.json","https://opendata.rdw.nl/resource/8ys7-d773.json","https://opendata.rdw.nl/resource/vezc-m2t6.json","https://opendata.rdw.nl/resource/jhie-znh9.json","https://opendata.rdw.nl/resource/kmfi-hrps.json"
"RP856D","Personenauto","MERCEDES-BENZ","GLA 200 D","20240108",,"6818","stationwagen","5","GRIJS","Niet geregistreerd","4","2143","1440","2035","1540","750","1500","20180108","20180108","Geen verstrekking in Open Data","47495","Nee",,,,,,,"5","4","0","0",,"446","180","M1",,,"onder r. voorzitting","2035","245 G",,"e1*2001/116*0470*18","27S1P2","MZAA1501","0","0.06","270","Ja","Nee",,"Nee","3575","0","0.00","2023","Logisch","00","Nee","2024-01-08T00:00:00.000",,"2018-01-08T00:00:00.000","2018-01-08T00:00:00.000",,,,,,,,,,,"154",,,,,,,,,,"E",,,,,,,"https://opendata.rdw.nl/resource/3huj-srit.json","https://opendata.rdw.nl/resource/8ys7-d773.json","https://opendata.rdw.nl/resource/vezc-m2t6.json","https://opendata.rdw.nl/resource/jhie-znh9.json","https://opendata.rdw.nl/resource/kmfi-hrps.json"