"kenteken","voertuigsoort","merk","handelsbenaming","vervaldatum_apk","datum_tenaamstelling","bruto_bpm","inrichting","aantal_zitplaatsen","eerste_kleur","tweede_kleur","aantal_cilinders","cilinderinhoud","massa_ledig_voertuig","toegestane_maximum_massa_voertuig","massa_rijklaar","maximum_massa_trekken_ongeremd","maximum_trekken_massa_geremd","datum_eerste_toelating","datum_eerste_tenaamstelling_in_nederland","wacht_op_keuren","catalogusprijs","wam_verzekerd","maximale_constructiesnelheid","laadvermogen","oplegger_geremd","aanhangwagen_autonoom_geremd","aanhangwagen_middenas_geremd","aantal_staanplaatsen","aantal_deuren","aantal_wielen","afstand_hart_koppeling_tot_achterzijde_voertuig","afstand_voorzijde_voertuig_tot_hart_koppeling","afwijkende_maximum_snelheid","lengte","breedte","europese_voertuigcategorie","europese_voertuigcategorie_toevoeging","europese_uitvoeringcategorie_toevoeging","plaats_chassisnummer","technische_max_massa_voertuig","type","type_gasinstallatie","typegoedkeuringsnummer","variant","uitvoering","volgnummer_wijziging_eu_typegoedkeuring","vermogen_massarijklaar","wielbasis","export_indicator","openstaande_terugroepactie_indicator","vervaldatum_tachograaf","taxi_indicator","maximum_massa_samenstelling","aantal_rolstoelplaatsen","maximum_ondersteunende_snelheid","jaar_laatste_registratie_tellerstand","tellerstandoordeel","code_toelichting_tellerstandoordeel","tenaamstellen_mogelijk","vervaldatum_apk_dt","datum_tenaamstelling_dt","datum_eerste_toelating_dt","datum_eerste_tenaamstelling_in_nederland_dt","vervaldatum_tachograaf_dt","maximum_last_onder_de_vooras_sen_tezamen_koppeling","type_remsysteem_voertuig_code","rupsonderstelconfiguratiecode","wielbasis_voertuig_minimum","wielbasis_voertuig_maximum","lengte_voertuig_minimum","lengte_voertuig_maximum","breedte_voertuig_minimum","breedte_voertuig_maximum","hoogte_voertuig","hoogte_voertuig_minimum","hoogte_voertuig_maximum","massa_bedrijfsklaar_minimaal","massa_bedrijfsklaar_maximaal","technisch_toelaatbaar_massa_koppelpunt","maximum_massa_technisch_maximaal","maximum_massa_technisch_minimaal","subcategorie_nederland","verticale_belasting_koppelpunt_getrokken_voertuig","zuinigheidsclassificatie","registratie_datum_goedkeuring_afschrijvingsmoment_bpm","registratie_datum_goedkeuring_afschrijvingsmoment_bpm_dt","gem_lading_wrde","aerodyn_voorz","massa_alt_aandr","verl_cab_ind","api_gekentekende_voertuigen_assen","api_gekentekende_voertuigen_brandstof","api_gekentekende_voertuigen_carrosserie","api_gekentekende_voertuigen_carrosserie_specifiek","api_gekentekende_voertuigen_voertuigklasse"
"2ZVK07","Personenauto","MERCEDES-BENZ","E 200 BLUETEC","20220812",,"7821","sedan","5","ZWART","Niet geregistreerd","4","2143","1635","2320","1735","750","1900","20150413","20150413","Geen verstrekking in Open Data","54748","Nee",,,,,,,"4","4","0","0",,"0","0","M1",,,"by dwarsbalk r. voorzitting","2320","212",,"e1*2001/116*0501*22","J00XP0","NZCCB500","0","0.06","287","Ja","Nee",,"Nee","4320","0","0.00","2023","Logisch","00","Nee","2022-08-12T00:00:00.000",,"2015-04-13T00:00:00.000","2015-04-13T00:00:00.000",,,,,,,,,,,,,,,,,,,,,"B",,,,,,,"https://opendata.rdw.nl/resource/3huj-srit.json","https://opendata.rdw.nl/resource/8ys7-d773.json","https://opendata.rdw.nl/resource/vezc-m2t6.json","https://opendata.rdw.nl/resource/jhie-znh9.json","https://opendata.rdw.nl/resource/kmfi-hrps.json"
"5ZGN18","Personenauto","MERCEDES-BENZ","E 200 BLUETEC","20240107",,"7719","sedan","5","BLAUW","Niet geregistreerd","4","2143","1635","2320","1735","750","1900","20150107","20150107","Geen verstrekking in Open Data","59947","Nee",,,,,,,"4","4","0","0",,"0","0","M1",,,"by dwarsbalk r. voorzitting","2320","212",,"e1*2001/116*0501*22","J00XP0","NZCCB501","0","0.06","287","Ja","Nee",,"Nee","4320","0","0.00","2023","Logisch","03","Nee","2024-01-07T00:00:00.000",,"2015-01-07T00:00:00.000","2015-01-07T00:00:00.000",,,,,,,,,,,,,,,,,,,,,"B",,,,,,,"https://opendata.rdw.nl/resource/3huj-srit.json","https://opendata.rdw.nl/resource/8ys7-d773.json","https://opendata.rdw.nl/resource/vezc-m2t6.json","https://opendata.rdw.nl/resource/jhie-znh9.json","https://opendata.rdw.nl/resource/kmfi-hrps.json"
"5ZGN23","Personenauto","MERCEDES-BENZ","E 200 BLUETEC","20241103","20240406","7719","sedan","5","BLAUW","Niet geregistreerd","4","2143","1635","2320","1735","750","1900","20150107","20150107","Geen verstrekking in Open Data","59947","Ja",,,,,,,"4","4","0","0",,"0","0","M1",,,"by dwarsbalk r. voorzitting","2320","212",,"e1*2001/116*0501*22","J00XP0","NZCCB501","0","0.06","287","Ja","Nee",,"Nee","4320","0","0.00","2024","Logisch","00","Nee","2024-11-03T00:00:00.000","2024-04-06T00:00:00.000","2015-01-07T00:00:00.000","2015-01-07T00:00:00.000",,,,,,,,,,,,,,,,,,,,,"B",,,,,,,"https://opendata.rdw.nl/resource/3huj-srit.json","https://opendata.rdw.nl/resource/8ys7-d773.json","https://opendata.rdw.nl/resource/vezc-m2t6.json","https://opendata.rdw.nl/resource/jhie-znh9.json","https://opendata.rdw.nl/resource/kmfi-hrps.json"
"6XPF09","Personenauto","MERCEDES-BENZ","E 200 BLUETEC","20230731","20231031","7719","sedan","5","ZWART","Niet geregistreerd","4","2143","1635","2320","1735","750","1900","20140929","20140929","Geen verstrekking in Open Data","57539","Ja",,,,,,,"4","4","0","0",,"0","0","M1",,,"by dwarsbalk r. voorzitting","2320","212",,"e1*2001/116*0501*22","J00XP0","NZCCB501","0","0.06","287","Ja","Nee",,"Nee","4320","0","0.00","2024","Onlogisch","04","Nee","2023-07-31T00:00:00.000","2023-10-31T00:00:00.000","2014-09-29T00:00:00.000","2014-09-29T00:00:00.000",,,,,,,,,,,,,,,,,,,,,"B",,,,,,,"https://opendata.rdw.nl/resource/3huj-srit.json","https://opendata.rdw.nl/resource/8ys7-d773.json","https://opendata.rdw.nl/resource/vezc-m2t6.json","https://opendata.rdw.nl/resource/jhie-znh9.json","https://opendata.rdw.nl/resource/kmfi-hrps.json"
"6XVS94","Personenauto","MERCEDES-BENZ","E 200 BLUETEC","20221114",,"7719","sedan","5","GRIJS","Niet geregistreerd","4","2143","1635","2320","1735","750","1900","20141113","20141113","Geen verstrekking in Open Data","58465","Nee",,,,,,,"4","4","0","0",,"0","0","M1",,,"by dwarsbalk r. voorzitting","2320","212",,"e1*2001/116*0501*22","J00XP0","NZCCB5A1","0","0.06","287","Ja","Nee",,"Nee","4320","0","0.00","2022","Logisch","00","Nee","2022-11-14T00:00:00.000",,"2014-11-13T00:00:00.000","2014-11-13T00:00:00.000",,,,,,,,,,,,,,,,,,,,,"B",,,,,,,"https://opendata.rdw.nl/resource/3huj-srit.json","https://opendata.rdw.nl/resource/8ys7-d773.json","https://opendata.rdw.nl/resource/vezc-m2t6.json","https://opendata.rdw.nl/resource/jhie-znh9.json","https://opendata.rdw.nl/resource/kmfi-hrps.json"
"6ZTK50","Personenauto","MERCEDES-BENZ","E 200 BLUETEC","20230411",,"8811","sedan","5","ZWART","Niet geregistreerd","4","2143","1635","2320","1735","750","1900","20150331","20150331","Geen verstrekking in Open Data","56567","Nee",,,,,,,"4","4","0","0",,"0","0","M1",,,"by dwarsbalk r. voorzitting","2320","212",,"e1*2001/116*0501*23","J00XP0","NZCCB504","0","0.06","287","Ja","Nee",,"Nee","4320","0","0.00","2022","Logisch","00","Nee","2023-04-11T00:00:00.000",,"2015-03-31T00:00:00.000","2015-03-31T00:00:00.000",,,,,,,,,,,,,,,,,,,,,"C",,,,,,,"https://opendata.rdw.nl/resource/3huj-srit.json","https://opendata.rdw.nl/resource/8ys7-d773.json","https://opendata.rdw.nl/resource/vezc-m2t6.json","https://opendata.rdw.nl/resource/jhie-znh9.json","https://opendata.rdw.nl/resource/kmfi-hrps.json"
"6ZTK52","Personenauto","MERCEDES-BENZ","E 200 BLUETEC","20240328",,"8415","sedan","5","ZWART","Niet geregistreerd","4","2143","1635","2320","1735","750","1900","20150327","20150327","Geen verstrekking in Open Data","58657","Ja",,,,,,,"4","4","0","0",,"0","0","M1",,,"by dwarsbalk r. voorzitting","2320","212",,"e1*2001/116*0501*22","J00XP0","NZCCB501","0","0.06","287","Ja","Nee",,"Nee","4320","0","0.00","2023","Logisch","00","Nee","2024-03-28T00:00:00.000",,"2015-03-27T00:00:00.000","2015-03-27T00:00:00.000",,,,,,,,,,,,,,,,,,,,,"B",,,,,,,"https://opendata.rdw.nl/resource/3huj-srit.json","https://opendata.rdw.nl/resource/8ys7-d773.json","https://opendata.rdw.nl/resource/vezc-m2t6.json","https://opendata.rdw.nl/resource/jhie-znh9.json","https://opendata.rdw.nl/resource/kmfi-hrps.json"
"7ZFV42","Personenauto","MERCEDES-BENZ","E 200 BLUETEC","20240622","20230809","7143","sedan","5","ZWART","Niet geregistreerd","4","2143","1635","2320","1735","750","1900","20150108","20150108","Geen verstrekking in Open Data","54519","Ja",,,,,,,"4","4","0","0",,"0","0","M1",,,"by dwarsbalk r. voorzitting","2320","212",,"e1*2001/116*0501*22","J00XP0","NZCCB5A0","0","0.06","287","Ja","Nee",,"Nee","4320","0","0.00","2024","Logisch","00","Nee","2024-06-22T00:00:00.000","2023-08-09T00:00:00.000","2015-01-08T00:00:00.000","2015-01-08T00:00:00.000",,,,,,,,,,,,,,,,,,,,,"B",,,,,,,"https://opendata.rdw.nl/resource/3huj-srit.json","https://opendata.rdw.nl/resource/8ys7-d773.json","https://opendata.rdw.nl/resource/vezc-m2t6.json","https://opendata.rdw.nl/resource/jhie-znh9.json","https://opendata.rdw.nl/resource/kmfi-hrps.json"
"7ZSG14","Personenauto","MERCEDES-BENZ","E 200 BLUETEC","20240317",,"8415","sedan","5","BLAUW","Niet geregistreerd","4","2143","1635","2320","1735","750","1900","20150317","20150317","Geen verstrekking in Open Data","62088","Nee",,,,,,,"4","4","0","0",,"0","0","M1",,,"by dwarsbalk r. voorzitting","2320","212",,"e1*2001/116*0501*22","J00XP0","NZCCB501","0","0.06","287","Ja","Nee",,"Nee","4320","0","0.00","2023","Logisch","00","Nee","2024-03-17T00:00:00.000",,"2015-03-17T00:00:00.000","2015-03-17T00:00:00.000",,,,,,,,,,,,,,,,,,,,,"B",,,,,,,"https://opendata.rdw.nl/resource/3huj-srit.json","https://opendata.rdw.nl/resource/8ys7-d773.json","https://opendata.rdw.nl/resource/vezc-m2t6.json","https://opendata.rdw.nl/resource/jhie-znh9.json","https://opendata.rdw.nl/resource/kmfi-hrps.json"
"9XNT21","Personenauto","MERCEDES-BENZ","E 200 BLUETEC","20230929",,"7719","sedan","5","ZWART","Niet geregistreerd","4","2143","1635","2320","1735","750","1900","20140929","20140929","Geen verstrekking in Open Data","56807","Nee",,,,,,,"4","4","0","0",,"0","0","M1",,,"by dwarsbalk r. voorzitting","2320","212",,"e1*2001/116*0501*22","J00XP0","NZCCB501","0","0.06","287","Ja","Nee",,"Nee","4320","0","0.00","2023","Logisch","00","Nee","2023-09-29T00:00:00.000",,"2014-09-29T00:00:00.000","2014-09-29T00:00:00.000",,,,,,,,,,,,,,,,,,,,,"B",,,,,,,"https://opendata.rdw.nl/resource/3huj-srit.json","https://opendata.rdw.nl/resource/8ys7-d773.json","https://opendata.rdw.nl/resource/vezc-m2t6.json","https://opendata.rdw.nl/resource/jhie-znh9.json","https://opendata.rdw.nl/resource/kmfi-hrps.json"
"9ZLP73","Personenauto","MERCEDES-BENZ","E 200 BLUETEC","20240504",,"7821","sedan","5","ZWART","Niet geregistreerd","4","2143","1635","2320","1735","750","1900","20150127","20150127","Geen verstrekking in Open Data","55619","Nee",,,,,,,"4","4","0","0",,"0","0","M1",,,"by dwarsbalk r. voorzitting","2320","212",,"e1*2001/116*0501*22","J00XP0","NZCCB5A0","0","0.06","287","Ja","Nee",,"Nee","4320","0","0.00","2023","Niet geregistreerd","NG","Nee","2024-05-04T00:00:00.000",,"2015-01-27T00:00:00.000","2015-01-27T00:00:00.000",,,,,,,,,,,,,,,,,,,,,"B",,,,,,,"https://opendata.rdw.nl/resource/3huj-srit.json","https://opendata.rdw.nl/resource/8ys7-d773.json","https://opendata.rdw.nl/resource/vezc-m2t6.json","https://opendata.rdw.nl/resource/jhie-znh9.json","https://opendata.rdw.nl/resource/kmfi-hrps.json"
"G279BN","Personenauto","MERCEDES-BENZ","E 200 BLUETEC","20240306",,"797","sedan","5","GRIJS","Niet geregistreerd","4","2143","1635","2320","1735","750","1900","20150622","20190822","Geen verstrekking in Open Data","53425","Ja","207",,,,,,"4","4","0","0",,"0","0","M1",,,,"2320","212",,"e1*2001/116*0501*23","J00XP0","NZCCB5A1","0","0.06","287","Ja","Nee",,"Nee","4320","0","0.00","2023","Onlogisch","04","Nee","2024-03-06T00:00:00.000",,"2015-06-22T00:00:00.000","2019-08-22T00:00:00.000",,,,,,,,,,,,,,,,,,,,,"B",,,,,,,"https://opendata.rdw.nl/resource/3huj-srit.json","https://opendata.rdw.nl/resource/8ys7-d773.json","https://opendata.rdw.nl/resource/vezc-m2t6.json","https://opendata.rdw.nl/resource/jhie-znh9.json","https://opendata.rdw.nl/resource/kmfi-hrps.json"
"GB638L","Personenauto","MERCEDES-BENZ","E 200 BLUETEC","20240922",,"8217","sedan","5","ZWART","Niet geregistreerd","4","2143","1635","2320","1735","750","1900","20150415","20150415","Geen verstrekking in Open Data","63069","Nee",,,,,,,"4","4","0","0",,"0","0","M1",,,"by dwarsbalk r. voorzitting","2320","212",,"e1*2001/116*0501*23","J00XP0","NZCCB502","0","0.06","287","Ja","Nee",,"Nee","4320","0","0.00","2023","Logisch","00","Nee","2024-09-22T00:00:00.000",,"2015-04-15T00:00:00.000","2015-04-15T00:00:00.000",,,,,,,,,,,,,,,,,,,,,"B",,,,,,,"https://opendata.rdw.nl/resource/3huj-srit.json","https://opendata.rdw.nl/resource/8ys7-d773.json","https://opendata.rdw.nl/resource/vezc-m2t6.json","https://opendata.rdw.nl/resource/jhie-znh9.json","https://opendata.rdw.nl/resource/kmfi-hrps.json"
"GF175K","Personenauto","MERCEDES-BENZ","E 200 BLUETEC","20240509",,"7623","sedan","5","ZWART","Niet geregistreerd","4","2143","1635","2320","1735","750","1900","20150430","20150430","Geen verstrekking in Open Data","54816","Nee",,,,,,,"4","4","0","0",,"0","0","M1",,,"by dwarsbalk r. voorzitting","2320","212",,"e1*2001/116*0501*23","J00XP0","NZCCB501","0","0.06","287","Ja","Nee",,"Nee","4320","0","0.00","2023","Logisch","00","Nee","2024-05-09T00:00:00.000",,"2015-04-30T00:00:00.000","2015-04-30T00:00:00.000",,,,,,,,,,,,,,,,,,,,,"B",,,,,,,"https://opendata.rdw.nl/resource/3huj-srit.json","https://opendata.rdw.nl/resource/8ys7-d773.json","https://opendata.rdw.nl/resource/vezc-m2t6.json","https://opendata.rdw.nl/resource/jhie-znh9.json","https://opendata.rdw.nl/resource/kmfi-hrps.json"
"GG266N","Personenauto","MERCEDES-BENZ","E 200 BLUETEC","20240913",,"9207","stationwagen","5","ZWART","Niet geregistreerd","4","2143","1745","2410","1845","750","2100","20150518","20150518","Geen verstrekking in Open Data","56112","Nee",,,,,,,"4","4","0","0",,"0","0","M1",,,"by dwarsbalk r. voorzitting","2410","212 K",,"e1*2007/46*0200*24","J20XP0","NZCCB501","0","0.05","287","Ja","Nee",,"Nee","4610","0","0.00","2023","Logisch","03","Nee","2024-09-13T00:00:00.000",,"2015-05-18T00:00:00.000","2015-05-18T00:00:00.000",,,,,,,,,,,,,,,,,,,,,"C",,,,,,,"https://opendata.rdw.nl/resource/3huj-srit.json","https://opendata.rdw.nl/resource/8ys7-d773.json","https://opendata.rdw.nl/resource/vezc-m2t6.json","https://opendata.rdw.nl/resource/jhie-znh9.json","https://opendata.rdw.nl/resource/kmfi-hrps.json"
"GP320K","Personenauto","MERCEDES-BENZ","E 200 BLUETEC","20230912",,"8415","sedan","5","GRIJS","Niet geregistreerd","4","2143","1635","2320","1735","750","1900","20150731","20150731","Geen verstrekking in Open Data","58657","Nee",,,,,,,"4","4","0","0",,"0","0","M1",,,"by dwarsbalk r. voorzitting","2320","212",,"e1*2001/116*0501*22","J00XP0","NZCCB501","0","0.06","287","Ja","Nee",,"Nee","4320","0","0.00","2022","Logisch","00","Nee","2023-09-12T00:00:00.000",,"2015-07-31T00:00:00.000","2015-07-31T00:00:00.000",,,,,,,,,,,,,,,,,,,,,"B",,,,,,,"https://opendata.rdw.nl/resource/3huj-srit.json","https://opendata.rdw.nl/resource/8ys7-d773.json","https://opendata.rdw.nl/resource/vezc-m2t6.json","https://opendata.rdw.nl/resource/jhie-znh9.json","https://opendata.rdw.nl/resource/kmfi-hrps.json"
"GP321K","Personenauto","MERCEDES-BENZ","E 200 BLUETEC",,,"8217","sedan","5","ZWART","Niet geregistreerd","4","2143","1635","2320","1735","750","1900","20150731","20150731","Geen verstrekking in Open Data","58181","Nee",,,,,,,"4","4","0","0",,"0","0","M1",,,"by dwarsbalk r. voorzitting","2320","212",,"e1*2001/116*0501*23","J00XP0","NZCCB502","0","0.06","287","Ja","Nee",,"Nee","4320","0","0.00","2022","Logisch","00","Nee",,,"2015-07-31T00:00:00.000","2015-07-31T00:00:00.000",,,,,,,,,,,,,,,,,,,,,"B",,,,,,,"https://opendata.rdw.nl/resource/3huj-srit.json","https://opendata.rdw.nl/resource/8ys7-d773.json","https://opendata.rdw.nl/resource/vezc-m2t6.json","https://opendata.rdw.nl/resource/jhie-znh9.json","https://opendata.rdw.nl/resource/kmfi-hrps.json"
"GP542P","Personenauto","MERCEDES-BENZ","E 200 BLUETEC","20230818",,"8811","sedan","5","ZWART","Niet geregistreerd","4","2143","1635","2320","1735","750","1900","20150814","20150814","Geen verstrekking in Open Data","59053","Nee",,,,,,,"4","4","0","0",,"0","0","M1",,,"by dwarsbalk r. voorzitting","2320","212",,"e1*2001/116*0501*23","J00XP0","NZCCB504","0","0.06","287","Ja","Nee",,"Nee","4320","0","0.00","2023","Logisch","00","Nee","2023-08-18T00:00:00.000",,"2015-08-14T00:00:00.000","2015-08-14T00:00:00.000",,,,,,,,,,,,,,,,,,,,,"C","20220829","2022-08-29T00:00:00.000",,,,,"https://opendata.rdw.nl/resource/3huj-srit.json","https://opendata.rdw.nl/resource/8ys7-d773.json","https://opendata.rdw.nl/resource/vezc-m2t6.json","https://opendata.rdw.nl/resource/jhie-znh9.json","https://opendata.rdw.nl/resource/kmfi-hrps.json"
"GR262L","Personenauto","MERCEDES-BENZ","E 200 BLUETEC",,,"8217","sedan","5","ZWART","Niet geregistreerd","4","2143","1635","2320","1735","750","1900","20150731","20150731","Geen verstrekking in Open Data","58260","Nee",,,,,,,"4","4","0","0",,"0","0","M1",,,"by dwarsbalk r. voorzitting","2320","212",,"e1*2001/116*0501*23","J00XP0","NZCCB502","0","0.06","287","Ja","Nee",,"Nee","4320","0","0.00","2019","Logisch","00","Nee",,,"2015-07-31T00:00:00.000","2015-07-31T00:00:00.000",,,,,,,,,,,,,,,,,,,,,"B",,,,,,,"https://opendata.rdw.nl/resource/3huj-srit.json","https://opendata.rdw.nl/resource/8ys7-d773.json","https://opendata.rdw.nl/resource/vezc-m2t6.json","https://opendata.rdw.nl/resource/jhie-znh9.json","https://opendata.rdw.nl/resource/kmfi-hrps.json"
"GR631N","Personenauto","MERCEDES-BENZ","E 200 BLUETEC",,,"8217","sedan","5","GRIJS","Niet geregistreerd","4","2143","1635","2320","1735","750","1900","20150731","20150731","Geen verstrekking in Open Data","58260","Nee",,,,,,,"4","4","0","0",,"0","0","M1",,,"by dwarsbalk r. voorzitting","2320","212",,"e1*2001/116*0501*23","J00XP0","NZCCB502","0","0.06","287","Ja","Nee",,"Nee","4320","0","0.00","2022","Logisch","00","Nee",,,"2015-07-31T00:00:00.000","2015-07-31T00:00:00.000",,,,,,,,,,,,,,,,,,,,,"B",,,,,,,"https://opendata.rdw.nl/resource/3huj-srit.json","https://opendata.rdw.nl/resource/8ys7-d773.json","https://opendata.rdw.nl/resource/vezc-m2t6.json","https://opendata.rdw.nl/resource/jhie-znh9.json","https://opendata.rdw.nl/resource/kmfi-hrps.json"
"GR637N","Personenauto","MERCEDES-BENZ","E 200 BLUETEC","20231007",,"8217","sedan","5","GRIJS","Niet geregistreerd","4","2143","1635","2320","1735","750","1900","20150731","20150731","Geen verstrekking in Open Data","58260","Nee",,,,,,,"4","4","0","0",,"0","0","M1",,,"by dwarsbalk r. voorzitting","2320","212",,"e1*2001/116*0501*23","J00XP0","NZCCB502","0","0.06","287","Ja","Nee",,"Nee","4320","0","0.00","2022","Logisch","00","Nee","2023-10-07T00:00:00.000",,"2015-07-31T00:00:00.000","2015-07-31T00:00:00.000",,,,,,,,,,,,,,,,,,,,,"B",,,,,,,"https://opendata.rdw.nl/resource/3huj-srit.json","https://opendata.rdw.nl/resource/8ys7-d773.json","https://opendata.rdw.nl/resource/vezc-m2t6.json","https://opendata.rdw.nl/resource/jhie-znh9.json","https://opendata.rdw.nl/resource/kmfi-hrps.json"
"GZ314Z","Personenauto","MERCEDES-BENZ","E 200 BLUETEC","20230930",,"7821","sedan","5","ZWART","Niet geregistreerd","4","2143","1635","2320","1735","750","1900","20150930","20150930","Geen verstrekking in Open Data","50501","Nee",,,,,,,"4","4","0","0",,"0","0","M1",,,"by dwarsbalk r. voorzitting","2320","212",,"e1*2001/116*0501*23","J00XP0","KZCCB5A1","0","0.06","287","Ja","Nee",,"Nee","4320","0","0.00","2023","Niet geregistreerd","NG","Nee","2023-09-30T00:00:00.000",,"2015-09-30T00:00:00.000","2015-09-30T00:00:00.000",,,,,,,,,,,,,,,,,,,,,"B",,,,,,,"https://opendata.rdw.nl/resource/3huj-srit.json","https://opendata.rdw.nl/resource/8ys7-d773.json","https://opendata.rdw.nl/resource/vezc-m2t6.json","https://opendata.rdw.nl/resource/jhie-znh9.json","https://opendata.rdw.nl/resource/kmfi-hrps.json"
"GZ321Z","Personenauto","MERCEDES-BENZ","E 200 BLUETEC","20231001",,"7821","sedan","5","ZWART","Niet geregistreerd","4","2143","1635","2320","1735","750","1900","20150930","20150930","Geen verstrekking in Open Data","50501","Nee",,,,,,,"4","4","0","0",,"0","0","M1",,,"by dwarsbalk r. voorzitting","2320","212",,"e1*2001/116*0501*23","J00XP0","KZCCB5A1","0","0.06","287","Ja","Nee",,"Nee","4320","0","0.00","2023","Niet geregistreerd","NG","Nee","2023-10-01T00:00:00.000",,"2015-09-30T00:00:00.000","2015-09-30T00:00:00.000",,,,,,,,,,,,,,,,,,,,,"B",,,,,,,"https://opendata.rdw.nl/resource/3huj-srit.json","https://opendata.rdw.nl/resource/8ys7-d773.json","https://opendata.rdw.nl/resource/vezc-m2t6.json","https://opendata.rdw.nl/resource/jhie-znh9.json","https://opendata.rdw.nl/resource/kmfi-hrps.json"
"H610DJ","Personenauto","MERCEDES-BENZ","E 200 BLUETEC","20240422",,"5076","sedan","5","WIT","Niet geregistreerd","4","2143","1635","2320","1735","750","1900","20150820","20191227","Geen verstrekking in Open Data","58761","Nee","207",,,,,,"4","4","0","0",,"0","0","M1",,,"by dwarsbalk r. voorzitting","2320","212",,"e1*2001/116*0501*23","J00XP0","NZCCB5A1","0","0.06","287","Ja","Nee",,"Nee","4320","0","0.00","2024","Onlogisch","04","Nee","2024-04-22T00:00:00.000",,"2015-08-20T00:00:00.000","2019-12-27T00:00:00.000",,,,,,,,,,,,,,,,,,,,,"B",,,,,,,"https://opendata.rdw.nl/resource/3huj-srit.json","https://opendata.rdw.nl/resource/8ys7-d773.json","https://opendata.rdw.nl/resource/vezc-m2t6.json","https://opendata.rdw.nl/resource/jhie-znh9.json","https://opendata.rdw.nl/resource/kmfi-hrps.json"
"HF407G","Personenauto","MERCEDES-BENZ","E 200 BLUETEC","20230301",,"3601","sedan","5","GRIJS","Niet geregistreerd","4","2143","1635","2320","1735","750","1900","20150218","20151117","Geen verstrekking in Open Data","61363","Nee",,,,,,,"4","4","0","0",,"0","0","M1",,,"by dwarsbalk r. voorzitting","2320","212",,"e1*2001/116*0501*22","J00XP0","NZCCB501","0","0.06","287","Ja","Nee",,"Nee","4320","0","0.00","2022","Geen oordeel","05","Nee","2023-03-01T00:00:00.000",,"2015-02-18T00:00:00.000","2015-11-17T00:00:00.000",,,,,,,,,,,,,,,,,,,,,"B",,,,,,,"https://opendata.rdw.nl/resource/3huj-srit.json","https://opendata.rdw.nl/resource/8ys7-d773.json","https://opendata.rdw.nl/resource/vezc-m2t6.json","https://opendata.rdw.nl/resource/jhie-znh9.json","https://opendata.rdw.nl/resource/kmfi-hrps.json"
"HG213V","Personenauto","MERCEDES-BENZ","E 200 BLUETEC","20230419",,"6511","sedan","5","ZWART","Niet geregistreerd","4","2143","1635","2320","1735","750","1900","20141126","20151026","Geen verstrekking in Open Data","61768","Nee",,,,,,,"4","4","0","0",,"0","0","M1",,,"by dwarsbalk r. voorzitting","2320","212",,"e1*2001/116*0501*22","J00XP0","NZCCB502","0","0.06","287","Ja","Nee",,"Nee","4320","0","0.00","2022","Geen oordeel","05","Nee","2023-04-19T00:00:00.000",,"2014-11-26T00:00:00.000","2015-10-26T00:00:00.000",,,,,,,,,,,,,,,,,,,,,"C",,,,,,,"https://opendata.rdw.nl/resource/3huj-srit.json","https://opendata.rdw.nl/resource/8ys7-d773.json","https://opendata.rdw.nl/resource/vezc-m2t6.json","https://opendata.rdw.nl/resource/jhie-znh9.json","https://opendata.rdw.nl/resource/kmfi-hrps.json"