"kenteken","voertuigsoort","merk","handelsbenaming","vervaldatum_apk","datum_tenaamstelling","bruto_bpm","inrichting","aantal_zitplaatsen","eerste_kleur","tweede_kleur","aantal_cilinders","cilinderinhoud","massa_ledig_voertuig","toegestane_maximum_massa_voertuig","massa_rijklaar","maximum_massa_trekken_ongeremd","maximum_trekken_massa_geremd","datum_eerste_toelating","datum_eerste_tenaamstelling_in_nederland","wacht_op_keuren","catalogusprijs","wam_verzekerd","maximale_constructiesnelheid","laadvermogen","oplegger_geremd","aanhangwagen_autonoom_geremd","aanhangwagen_middenas_geremd","aantal_staanplaatsen","aantal_deuren","aantal_wielen","afstand_hart_koppeling_tot_achterzijde_voertuig","afstand_voorzijde_voertuig_tot_hart_koppeling","afwijkende_maximum_snelheid","lengte","breedte","europese_voertuigcategorie","europese_voertuigcategorie_toevoeging","europese_uitvoeringcategorie_toevoeging","plaats_chassisnummer","technische_max_massa_voertuig","type","type_gasinstallatie","typegoedkeuringsnummer","variant","uitvoering","volgnummer_wijziging_eu_typegoedkeuring","vermogen_massarijklaar","wielbasis","export_indicator","openstaande_terugroepactie_indicator","vervaldatum_tachograaf","taxi_indicator","maximum_massa_samenstelling","aantal_rolstoelplaatsen","maximum_ondersteunende_snelheid","jaar_laatste_registratie_tellerstand","tellerstandoordeel","code_toelichting_tellerstandoordeel","tenaamstellen_mogelijk","vervaldatum_apk_dt","datum_tenaamstelling_dt","datum_eerste_toelating_dt","datum_eerste_tenaamstelling_in_nederland_dt","vervaldatum_tachograaf_dt","maximum_last_onder_de_vooras_sen_tezamen_koppeling","type_remsysteem_voertuig_code","rupsonderstelconfiguratiecode","wielbasis_voertuig_minimum","wielbasis_voertuig_maximum","lengte_voertuig_minimum","lengte_voertuig_maximum","breedte_voertuig_minimum","breedte_voertuig_maximum","hoogte_voertuig","hoogte_voertuig_minimum","hoogte_voertuig_maximum","massa_bedrijfsklaar_minimaal","massa_bedrijfsklaar_maximaal","technisch_toelaatbaar_massa_koppelpunt","maximum_massa_technisch_maximaal","maximum_massa_technisch_minimaal","subcategorie_nederland","verticale_belasting_koppelpunt_getrokken_voertuig","zuinigheidsclassificatie","registratie_datum_goedkeuring_afschrijvingsmoment_bpm","registratie_datum_goedkeuring_afschrijvingsmoment_bpm_dt","gem_lading_wrde","aerodyn_voorz","massa_alt_aandr","verl_cab_ind","api_gekentekende_voertuigen_assen","api_gekentekende_voertuigen_brandstof","api_gekentekende_voertuigen_carrosserie","api_gekentekende_voertuigen_carrosserie_specifiek","api_gekentekende_voertuigen_voertuigklasse"
"G093PS","Personenauto","MERCEDES-BENZ","C 180 D","20231115",,"8678","sedan","5","GRIJS","Niet geregistreerd","4","1597","1465","2145","1565","750","1800","20191115","20191115","Geen verstrekking in Open Data","46188","Nee","207",,,,,,"4","4","0","0",,"476","184","M1",,,,"2145","204",,"e1*2001/116*0431*49","R000T0","CZAA157C","0","0.06","284","Ja","Nee",,"Nee","4015","0","0.00","2023","Logisch","00","Nee","2023-11-15T00:00:00.000",,"2019-11-15T00:00:00.000","2019-11-15T00:00:00.000",,,,,,,,,,,"145",,,,,,,,,,,,,,,,,"https://opendata.rdw.nl/resource/3huj-srit.json","https://opendata.rdw.nl/resource/8ys7-d773.json","https://opendata.rdw.nl/resource/vezc-m2t6.json","https://opendata.rdw.nl/resource/jhie-znh9.json","https://opendata.rdw.nl/resource/kmfi-hrps.json"
"G472VH","Personenauto","MERCEDES-BENZ","C 180 D","20221217",,"2578","stationwagen","5","ZWART","Niet geregistreerd","4","1598","1450","2125","1550","750","1600","20161121","20191217","Geen verstrekking in Open Data","51492","Nee","201",,,,,,"5","4",,,,,,"M1",,,,"2125","204 K",,"e1*2001/116*0457*32","R23KP0","PZAA0572","0","0.05","284","Ja","Nee",,"Nee","3785",,,"2022","Geen oordeel","05","Nee","2022-12-17T00:00:00.000",,"2016-11-21T00:00:00.000","2019-12-17T00:00:00.000",,,,,,,,,,,,,,,,,,,,,"E",,,,,,,"https://opendata.rdw.nl/resource/3huj-srit.json","https://opendata.rdw.nl/resource/8ys7-d773.json","https://opendata.rdw.nl/resource/vezc-m2t6.json","https://opendata.rdw.nl/resource/jhie-znh9.json","https://opendata.rdw.nl/resource/kmfi-hrps.json"
"G507DF","Personenauto","MERCEDES-BENZ","C 180 D","20240828",,"3041","stationwagen","5","ZWART","Niet geregistreerd","4","1598","1450","2125","1550","750","1600","20170414","20190830","Geen verstrekking in Open Data","49593","Nee","201",,,,,,"5","4",,,,,,"M1",,,,"2125","204 K",,"e1*2001/116*0457*34","R23KP0","PZAA052X","0","0.05","284","Ja","Nee",,"Nee","3785",,,"2023","Geen oordeel","05","Nee","2024-08-28T00:00:00.000",,"2017-04-14T00:00:00.000","2019-08-30T00:00:00.000",,,,,,,,,,,,,,,,,,,,,"D",,,,,,,"https://opendata.rdw.nl/resource/3huj-srit.json","https://opendata.rdw.nl/resource/8ys7-d773.json","https://opendata.rdw.nl/resource/vezc-m2t6.json","https://opendata.rdw.nl/resource/jhie-znh9.json","https://opendata.rdw.nl/resource/kmfi-hrps.json"
"G756VH","Personenauto","MERCEDES-BENZ","C 180 D","20231213",,"9117","stationwagen","5","ZWART","Niet geregistreerd","4","1597","1515","2205","1615","750","1800","20191213","20191213","Geen verstrekking in Open Data","47837","Nee","201",,,,,,"5","4","0","0",,"477","184","M1",,,,"2205","204 K",,"e1*2001/116*0457*42","R200T0","CZAA157C","0","0.06","284","Ja","Nee",,"Nee","4075","0","0.00","2022","Logisch","00","Nee","2023-12-13T00:00:00.000",,"2019-12-13T00:00:00.000","2019-12-13T00:00:00.000",,,,,,,,,,,"147",,,,,,,,,,,,,,,,,"https://opendata.rdw.nl/resource/3huj-srit.json","https://opendata.rdw.nl/resource/8ys7-d773.json","https://opendata.rdw.nl/resource/vezc-m2t6.json","https://opendata.rdw.nl/resource/jhie-znh9.json","https://opendata.rdw.nl/resource/kmfi-hrps.json"
"GV674G","Personenauto","MERCEDES-BENZ","C 180 D","20221022",,"5884","stationwagen","5","BLAUW","Niet geregistreerd","4","1598","1450","2125","1550","750","1600","20150831","20150831","Geen verstrekking in Open Data","44939","Nee",,,,,,,"5","4","0","0",,"0","0","M1",,,"op dwarsbalk v. r. voorzitting","2125","204 K",,"e1*2001/116*0457*29","R23KP0","PZAAB52X","0","0.05","284","Ja","Nee",,"Nee","3785","0","0.00","2022","Logisch","00","Nee","2022-10-22T00:00:00.000",,"2015-08-31T00:00:00.000","2015-08-31T00:00:00.000",,,,,,,,,,,,,,,,,,,,,"B",,,,,,,"https://opendata.rdw.nl/resource/3huj-srit.json","https://opendata.rdw.nl/resource/8ys7-d773.json","https://opendata.rdw.nl/resource/vezc-m2t6.json","https://opendata.rdw.nl/resource/jhie-znh9.json","https://opendata.rdw.nl/resource/kmfi-hrps.json"
"GZ388R","Personenauto","MERCEDES-BENZ","C 180 D","20220923",,"5884","stationwagen","5","ZWART","Niet geregistreerd","4","1598","1450","2125","1550","750","1600","20150923","20150923","Geen verstrekking in Open Data","46133","Nee",,,,,,,"5","4","0","0",,"0","0","M1",,,"op dwarsbalk v. r. voorzitting","2125","204 K",,"e1*2001/116*0457*29","R23KP0","PZAAB50X","0","0.05","284","Ja","Nee",,"Nee","3785","0","0.00","2022","Logisch","00","Nee","2022-09-23T00:00:00.000",,"2015-09-23T00:00:00.000","2015-09-23T00:00:00.000",,,,,,,,,,,,,,,,,,,,,"B",,,,,,,"https://opendata.rdw.nl/resource/3huj-srit.json","https://opendata.rdw.nl/resource/8ys7-d773.json","https://opendata.rdw.nl/resource/vezc-m2t6.json","https://opendata.rdw.nl/resource/jhie-znh9.json","https://opendata.rdw.nl/resource/kmfi-hrps.json"
"H040JZ","Personenauto","MERCEDES-BENZ","C 180 D","20240922","20240405","6053","stationwagen","5","WIT","Niet geregistreerd","4","1598","1485","2160","1585","750","1600","20151029","20200619","Geen verstrekking in Open Data","48127","Ja","200",,,,,,"5","4","0","0",,"0","0","M1",,,,"2160","204 K",,"e1*2001/116*0457*29","R23KP0","NZAAB572","0","0.05","284","Ja","Ja",,"Nee","3820","0","0.00","2024","Onlogisch","04","Nee","2024-09-22T00:00:00.000","2024-04-05T00:00:00.000","2015-10-29T00:00:00.000","2020-06-19T00:00:00.000",,,,,,,,,,,,,,,,,,,,,"D",,,,,,,"https://opendata.rdw.nl/resource/3huj-srit.json","https://opendata.rdw.nl/resource/8ys7-d773.json","https://opendata.rdw.nl/resource/vezc-m2t6.json","https://opendata.rdw.nl/resource/jhie-znh9.json","https://opendata.rdw.nl/resource/kmfi-hrps.json"
"H163FN","Personenauto","MERCEDES-BENZ","C 180 D","20240202",,"6672","stationwagen","5","GRIJS","Niet geregistreerd","4","1598","1485","2160","1585","750","1600","20150703","20200108","Geen verstrekking in Open Data","45682","Nee","200",,,,,,"5","4","0","0",,"0","0","M1",,,"r. dwarsbalk by voorzitting","2160","204 K",,"e1*2001/116*0457*29","R23KP0","NZAAB521","0","0.05","284","Ja","Nee",,"Nee","3820","0","0.00","2023","Geen oordeel","05","Nee","2024-02-02T00:00:00.000",,"2015-07-03T00:00:00.000","2020-01-08T00:00:00.000",,,,,,,,,,,,,,,,,,,,,"C",,,,,,,"https://opendata.rdw.nl/resource/3huj-srit.json","https://opendata.rdw.nl/resource/8ys7-d773.json","https://opendata.rdw.nl/resource/vezc-m2t6.json","https://opendata.rdw.nl/resource/jhie-znh9.json","https://opendata.rdw.nl/resource/kmfi-hrps.json"
"H172JV","Personenauto","MERCEDES-BENZ","C 180 D","20230203",,"579","stationwagen","5","GRIJS","Niet geregistreerd","4","1598","1450","2125","1550","750","1600","20160105","20200227","Geen verstrekking in Open Data","47733","Nee","201",,,,,,"5","4","0","0",,"0","0","M1",,,,"2125","204 K",,"e1*2001/116*0457*31","R23KP0","PZAA0521","0","0.05","284","Ja","Nee",,"Nee","3785","0","0.00","2022","Geen oordeel","05","Nee","2023-02-03T00:00:00.000",,"2016-01-05T00:00:00.000","2020-02-27T00:00:00.000",,,,,,,,,,,,,,,,,,,,,"D",,,,,,,"https://opendata.rdw.nl/resource/3huj-srit.json","https://opendata.rdw.nl/resource/8ys7-d773.json","https://opendata.rdw.nl/resource/vezc-m2t6.json","https://opendata.rdw.nl/resource/jhie-znh9.json","https://opendata.rdw.nl/resource/kmfi-hrps.json"
"H377GD","Personenauto","MERCEDES-BENZ","C 180 D","20240124",,"9767","stationwagen","5","GRIJS","Niet geregistreerd","4","1597","1515","2205","1615","750","1800","20200124","20200124","Geen verstrekking in Open Data","48487","Nee","201",,,,,,"5","4","0","0",,"477","184","M1",,,,"2205","204 K",,"e1*2001/116*0457*42","R200T0","CZAA157C","0","0.06","284","Ja","Nee",,"Nee","4075","0","0.00","2023","Logisch","00","Nee","2024-01-24T00:00:00.000",,"2020-01-24T00:00:00.000","2020-01-24T00:00:00.000",,,,,,,,,,,"147",,,,,,,,,,"C",,,,,,,"https://opendata.rdw.nl/resource/3huj-srit.json","https://opendata.rdw.nl/resource/8ys7-d773.json","https://opendata.rdw.nl/resource/vezc-m2t6.json","https://opendata.rdw.nl/resource/jhie-znh9.json","https://opendata.rdw.nl/resource/kmfi-hrps.json"
"H385VP","Personenauto","MERCEDES-BENZ","C 180 D","20240610",,"9767","stationwagen","5","GRIJS","Niet geregistreerd","4","1597","1515","2205","1615","750","1800","20200610","20200610","Geen verstrekking in Open Data","48487","Nee","201",,,,,,"5","4","0","0",,"477","184","M1",,,,"2205","204 K",,"e1*2001/116*0457*42","R200T0","CZAA157C","0","0.06","284","Ja","Nee",,"Nee","4075","0","0.00","2023","Logisch","00","Nee","2024-06-10T00:00:00.000",,"2020-06-10T00:00:00.000","2020-06-10T00:00:00.000",,,,,,,,,,,"147",,,,,,,,,,"C",,,,,,,"https://opendata.rdw.nl/resource/3huj-srit.json","https://opendata.rdw.nl/resource/8ys7-d773.json","https://opendata.rdw.nl/resource/vezc-m2t6.json","https://opendata.rdw.nl/resource/jhie-znh9.json","https://opendata.rdw.nl/resource/kmfi-hrps.json"
"H632BS","Personenauto","MERCEDES-BENZ","C 180 D","20250117","20240220","9117","stationwagen","5","WIT","Niet geregistreerd","4","1597","1515","2205","1615","750","1800","20200109","20200109","Geen verstrekking in Open Data","47837","Ja","201",,,,,,"5","4","0","0",,"477","184","M1",,,,"2205","204 K",,"e1*2001/116*0457*42","R200T0","CZAA157C","0","0.06","284","Ja","Nee",,"Nee","4075","0","0.00","2024","Logisch","00","Nee","2025-01-17T00:00:00.000","2024-02-20T00:00:00.000","2020-01-09T00:00:00.000","2020-01-09T00:00:00.000",,,,,,,,,,,"147",,,,,,,,,,"C",,,,,,,"https://opendata.rdw.nl/resource/3huj-srit.json","https://opendata.rdw.nl/resource/8ys7-d773.json","https://opendata.rdw.nl/resource/vezc-m2t6.json","https://opendata.rdw.nl/resource/jhie-znh9.json","https://opendata.rdw.nl/resource/kmfi-hrps.json"
"H653KT","Personenauto","MERCEDES-BENZ","C 180 D","20240228","20240207","9767","stationwagen","5","GRIJS","Niet geregistreerd","4","1597","1515","2205","1615","750","1800","20200228","20200228","Geen verstrekking in Open Data","48487","Ja","201",,,,,,"5","4","0","0",,"477","184","M1",,,,"2205","204 K",,"e1*2001/116*0457*42","R200T0","CZAA157C","0","0.06","284","Ja","Nee",,"Nee","4075","0","0.00","2024","Logisch","00","Nee","2024-02-28T00:00:00.000","2024-02-07T00:00:00.000","2020-02-28T00:00:00.000","2020-02-28T00:00:00.000",,,,,,,,,,,"147",,,,,,,,,,"C",,,,,,,"https://opendata.rdw.nl/resource/3huj-srit.json","https://opendata.rdw.nl/resource/8ys7-d773.json","https://opendata.rdw.nl/resource/vezc-m2t6.json","https://opendata.rdw.nl/resource/jhie-znh9.json","https://opendata.rdw.nl/resource/kmfi-hrps.json"
"H699NH","Personenauto","MERCEDES-BENZ","C 180 D","20240326",,"9330","sedan","5","GRIJS","Niet geregistreerd","4","1597","1465","2145","1565","750","1800","20200326","20200326","Geen verstrekking in Open Data","46840","Nee","207",,,,,,"4","4","0","0",,"476","184","M1",,,,"2145","204",,"e1*2001/116*0431*51","R000T0","CZAA157C","0","0.06","284","Ja","Nee",,"Nee","4015","0","0.00","2024","Logisch","00","Nee","2024-03-26T00:00:00.000",,"2020-03-26T00:00:00.000","2020-03-26T00:00:00.000",,,,,,,,,,,"145",,,,,,,,,,"C",,,,,,,"https://opendata.rdw.nl/resource/3huj-srit.json","https://opendata.rdw.nl/resource/8ys7-d773.json","https://opendata.rdw.nl/resource/vezc-m2t6.json","https://opendata.rdw.nl/resource/jhie-znh9.json","https://opendata.rdw.nl/resource/kmfi-hrps.json"
"H771FR","Personenauto","MERCEDES-BENZ","C 180 D","20240715","20240414","5955","stationwagen","5","GRIJS","Niet geregistreerd","4","1598","1450","2125","1550","750","1600","20160715","20200110","Geen verstrekking in Open Data","87110","Ja","201",,,,,,"5","4",,,,,,"M1",,,,"2125","204 K",,"e1*2001/116*0457*32","R23KP0","PZAZ0572","0","0.05","284","Ja","Nee",,"Nee","3785",,,"2024","Geen oordeel","05","Nee","2024-07-15T00:00:00.000","2024-04-14T00:00:00.000","2016-07-15T00:00:00.000","2020-01-10T00:00:00.000",,,,,,,,,,,,,,,,,,,,,"E",,,,,,,"https://opendata.rdw.nl/resource/3huj-srit.json","https://opendata.rdw.nl/resource/8ys7-d773.json","https://opendata.rdw.nl/resource/vezc-m2t6.json","https://opendata.rdw.nl/resource/jhie-znh9.json","https://opendata.rdw.nl/resource/kmfi-hrps.json"
"H786SR","Personenauto","MERCEDES-BENZ","C 180 D","20240704",,"2628","stationwagen","5","GRIJS","Niet geregistreerd","4","1598","1485","2160","1585","750","1600","20170426","20201017","Geen verstrekking in Open Data","53026","Nee",,,,,,,"5","4","0","0",,"0","0","M1",,,"r. dwarsbalk by voorzitting","2160","204 K",,"e1*2001/116*0457*34","R23KP0","NZAA050X","0","0.05","284","Ja","Ja",,"Nee","3820","0","0.00","2023","Onlogisch","04","Nee","2024-07-04T00:00:00.000",,"2017-04-26T00:00:00.000","2020-10-17T00:00:00.000",,,,,,,,,,,,,,,,,,,,,"D",,,,,,,"https://opendata.rdw.nl/resource/3huj-srit.json","https://opendata.rdw.nl/resource/8ys7-d773.json","https://opendata.rdw.nl/resource/vezc-m2t6.json","https://opendata.rdw.nl/resource/jhie-znh9.json","https://opendata.rdw.nl/resource/kmfi-hrps.json"
"HB021N","Personenauto","MERCEDES-BENZ","C 180 D","20230315",,"6237","sedan","5","ZWART","Niet geregistreerd","4","1598","1405","2075","1505","750","1600","20151007","20151007","Geen verstrekking in Open Data","55102","Nee",,,,,,,"4","4","0","0",,"0","0","M1",,,"op dwarsbalk v. r. voorzitting","2075","204",,"e1*2001/116*0431*36","R03KP0","NZABB521","0","0.06","284","Ja","Nee",,"Nee","3740","0","0.00","2022","Logisch","00","Nee","2023-03-15T00:00:00.000",,"2015-10-07T00:00:00.000","2015-10-07T00:00:00.000",,,,,,,,,,,,,,,,,,,,,"C",,,,,,,"https://opendata.rdw.nl/resource/3huj-srit.json","https://opendata.rdw.nl/resource/8ys7-d773.json","https://opendata.rdw.nl/resource/vezc-m2t6.json","https://opendata.rdw.nl/resource/jhie-znh9.json","https://opendata.rdw.nl/resource/kmfi-hrps.json"
"HB453D","Personenauto","MERCEDES-BENZ","C 180 D","20230607",,"5884","stationwagen","5","ZWART","Niet geregistreerd","4","1598","1450","2125","1550","750","1600","20150930","20150930","Geen verstrekking in Open Data","43995","Nee",,,,,,,"5","4","0","0",,"0","0","M1",,,"op dwarsbalk v. r. voorzitting","2125","204 K",,"e1*2001/116*0457*29","R23KP0","PZAAB52X","0","0.05","284","Ja","Nee",,"Nee","3785","0","0.00","2023","Logisch","00","Nee","2023-06-07T00:00:00.000",,"2015-09-30T00:00:00.000","2015-09-30T00:00:00.000",,,,,,,,,,,,,,,,,,,,,"B",,,,,,,"https://opendata.rdw.nl/resource/3huj-srit.json","https://opendata.rdw.nl/resource/8ys7-d773.json","https://opendata.rdw.nl/resource/vezc-m2t6.json","https://opendata.rdw.nl/resource/jhie-znh9.json","https://opendata.rdw.nl/resource/kmfi-hrps.json"
"HD246K","Personenauto","MERCEDES-BENZ","C 180 D","20231107","20231025","5884","stationwagen","5","ZWART","Niet geregistreerd","4","1598","1450","2125","1550","750","1600","20151005","20151005","Geen verstrekking in Open Data","44493","Ja",,,,,,,"5","4","0","0",,"0","0","M1",,,"op dwarsbalk v. r. voorzitting","2125","204 K",,"e1*2001/116*0457*29","R23KP0","PZAAB52X","0","0.05","284","Ja","Nee",,"Nee","3785","0","0.00","2024","Geen oordeel","05","Nee","2023-11-07T00:00:00.000","2023-10-25T00:00:00.000","2015-10-05T00:00:00.000","2015-10-05T00:00:00.000",,,,,,,,,,,,,,,,,,,,,"B",,,,,,,"https://opendata.rdw.nl/resource/3huj-srit.json","https://opendata.rdw.nl/resource/8ys7-d773.json","https://opendata.rdw.nl/resource/vezc-m2t6.json","https://opendata.rdw.nl/resource/jhie-znh9.json","https://opendata.rdw.nl/resource/kmfi-hrps.json"
"HD690L","Personenauto","MERCEDES-BENZ","C 180 D","20231118",,"5884","stationwagen","5","ZWART","Niet geregistreerd","4","1598","1450","2125","1550","750","1600","20151007","20151007","Geen verstrekking in Open Data","44939","Nee",,,,,,,"5","4","0","0",,"0","0","M1",,,"op dwarsbalk v. r. voorzitting","2125","204 K",,"e1*2001/116*0457*29","R23KP0","PZAAB52X","0","0.05","284","Ja","Nee",,"Nee","3785","0","0.00","2023","Logisch","00","Nee","2023-11-18T00:00:00.000",,"2015-10-07T00:00:00.000","2015-10-07T00:00:00.000",,,,,,,,,,,,,,,,,,,,,"B",,,,,,,"https://opendata.rdw.nl/resource/3huj-srit.json","https://opendata.rdw.nl/resource/8ys7-d773.json","https://opendata.rdw.nl/resource/vezc-m2t6.json","https://opendata.rdw.nl/resource/jhie-znh9.json","https://opendata.rdw.nl/resource/kmfi-hrps.json"
"HJ761R","Personenauto","MERCEDES-BENZ","C 180 D","20240324",,"5884","stationwagen","5","GRIJS","Niet geregistreerd","4","1598","1450","2125","1550","750","1600","20151116","20151116","Geen verstrekking in Open Data","44939","Nee",,,,,,,"5","4","0","0",,"477","184","M1",,,"onder r. voorzitting","2125","204 K",,"e1*2001/116*0457*29","R23KP0","PZAAB52X","0","0.05","284","Ja","Nee",,"Nee","3785","0","0.00","2023","Logisch","00","Nee","2024-03-24T00:00:00.000",,"2015-11-16T00:00:00.000","2015-11-16T00:00:00.000",,,,,,,,,,,"147",,,,,,,,,,"B",,,,,,,"https://opendata.rdw.nl/resource/3huj-srit.json","https://opendata.rdw.nl/resource/8ys7-d773.json","https://opendata.rdw.nl/resource/vezc-m2t6.json","https://opendata.rdw.nl/resource/jhie-znh9.json","https://opendata.rdw.nl/resource/kmfi-hrps.json"
"HL523H","Personenauto","MERCEDES-BENZ","C 180 D","20240907","20240404","4644","sedan","5","WIT","Niet geregistreerd","4","1598","1385","2055","1485","740","1600","20151128","20151128","Geen verstrekking in Open Data","40685","Ja",,,,,,,"4","4","0","0",,"476","184","M1",,,"onder r. voorzitting","2055","204",,"e1*2001/116*0431*36","R03KP0","PZABB521","0","0.06","284","Ja","Nee",,"Nee","3720","0","0.00","2024","Logisch","00","Nee","2024-09-07T00:00:00.000","2024-04-04T00:00:00.000","2015-11-28T00:00:00.000","2015-11-28T00:00:00.000",,,,,,,,,,,"146",,,,,,,,,,"B",,,,,,,"https://opendata.rdw.nl/resource/3huj-srit.json","https://opendata.rdw.nl/resource/8ys7-d773.json","https://opendata.rdw.nl/resource/vezc-m2t6.json","https://opendata.rdw.nl/resource/jhie-znh9.json","https://opendata.rdw.nl/resource/kmfi-hrps.json"
"HN671V","Personenauto","MERCEDES-BENZ","C 180 D","20240529",,"5419","sedan","5","ZWART","Niet geregistreerd","4","1598","1385","2055","1485","740","1600","20151209","20151209","Geen verstrekking in Open Data","51737","Nee",,,,,,,"4","4","0","0",,"476","184","M1",,,"onder r. voorzitting","2055","204",,"e1*2001/116*0431*36","R03KP0","PZABB572","0","0.06","284","Ja","Nee",,"Nee","3720","0","0.00","2023","Logisch","00","Nee","2024-05-29T00:00:00.000",,"2015-12-09T00:00:00.000","2015-12-09T00:00:00.000",,,,,,,,,,,"146",,,,,,,,,,"B",,,,,,,"https://opendata.rdw.nl/resource/3huj-srit.json","https://opendata.rdw.nl/resource/8ys7-d773.json","https://opendata.rdw.nl/resource/vezc-m2t6.json","https://opendata.rdw.nl/resource/jhie-znh9.json","https://opendata.rdw.nl/resource/kmfi-hrps.json"
"HN718N","Personenauto","MERCEDES-BENZ","C 180 D","20240916",,"5884","sedan","5","GRIJS","Niet geregistreerd","4","1598","1405","2075","1505","750","1600","20151204","20151204","Geen verstrekking in Open Data","47616","Nee",,,,,,,"4","4","0","0",,"476","184","M1",,,"onder r. voorzitting","2075","204",,"e1*2001/116*0431*36","R03KP0","NZABB50X","0","0.06","284","Ja","Nee",,"Nee","3740","0","0.00","2023","Logisch","00","Nee","2024-09-16T00:00:00.000",,"2015-12-04T00:00:00.000","2015-12-04T00:00:00.000",,,,,,,,,,,"146",,,,,,,,,,"C",,,,,,,"https://opendata.rdw.nl/resource/3huj-srit.json","https://opendata.rdw.nl/resource/8ys7-d773.json","https://opendata.rdw.nl/resource/vezc-m2t6.json","https://opendata.rdw.nl/resource/jhie-znh9.json","https://opendata.rdw.nl/resource/kmfi-hrps.json"
"HN959Z","Personenauto","MERCEDES-BENZ","C 180 D","20231007",,"5884","stationwagen","5","GRIJS","Niet geregistreerd","4","1598","1450","2125","1550","750","1600","20151211","20151211","Geen verstrekking in Open Data","44939","Nee",,,,,,,"5","4","0","0",,"477","184","M1",,,"onder r. voorzitting","2125","204 K",,"e1*2001/116*0457*29","R23KP0","PZAAB52X","0","0.05","284","Ja","Nee",,"Nee","3785","0","0.00","2023","Logisch","00","Nee","2023-10-07T00:00:00.000",,"2015-12-11T00:00:00.000","2015-12-11T00:00:00.000",,,,,,,,,,,"147",,,,,,,,,,"B",,,,,,,"https://opendata.rdw.nl/resource/3huj-srit.json","https://opendata.rdw.nl/resource/8ys7-d773.json","https://opendata.rdw.nl/resource/vezc-m2t6.json","https://opendata.rdw.nl/resource/jhie-znh9.json","https://opendata.rdw.nl/resource/kmfi-hrps.json"
"HR351S","Personenauto","MERCEDES-BENZ","C 180 D","20221228",,"5884","sedan","5","ZWART","Niet geregistreerd","4","1598","1405","2075","1505","750","1600","20151228","20151228","Geen verstrekking in Open Data","46491","Nee",,,,,,,"4","4","0","0",,"0","0","M1",,,"onder r. voorzitting","2075","204",,"e1*2001/116*0431*36","R03KP0","NZABB50X","0","0.06","284","Ja","Nee",,"Nee","3740","0","0.00","2021","Logisch","00","Nee","2022-12-28T00:00:00.000",,"2015-12-28T00:00:00.000","2015-12-28T00:00:00.000",,,,,,,,,,,,,,,,,,,,,"C",,,,,,,"https://opendata.rdw.nl/resource/3huj-srit.json","https://opendata.rdw.nl/resource/8ys7-d773.json","https://opendata.rdw.nl/resource/vezc-m2t6.json","https://opendata.rdw.nl/resource/jhie-znh9.json","https://opendata.rdw.nl/resource/kmfi-hrps.json"