"kenteken","voertuigsoort","merk","handelsbenaming","vervaldatum_apk","datum_tenaamstelling","bruto_bpm","inrichting","aantal_zitplaatsen","eerste_kleur","tweede_kleur","aantal_cilinders","cilinderinhoud","massa_ledig_voertuig","toegestane_maximum_massa_voertuig","massa_rijklaar","maximum_massa_trekken_ongeremd","maximum_trekken_massa_geremd","datum_eerste_toelating","datum_eerste_tenaamstelling_in_nederland","wacht_op_keuren","catalogusprijs","wam_verzekerd","maximale_constructiesnelheid","laadvermogen","oplegger_geremd","aanhangwagen_autonoom_geremd","aanhangwagen_middenas_geremd","aantal_staanplaatsen","aantal_deuren","aantal_wielen","afstand_hart_koppeling_tot_achterzijde_voertuig","afstand_voorzijde_voertuig_tot_hart_koppeling","afwijkende_maximum_snelheid","lengte","breedte","europese_voertuigcategorie","europese_voertuigcategorie_toevoeging","europese_uitvoeringcategorie_toevoeging","plaats_chassisnummer","technische_max_massa_voertuig","type","type_gasinstallatie","typegoedkeuringsnummer","variant","uitvoering","volgnummer_wijziging_eu_typegoedkeuring","vermogen_massarijklaar","wielbasis","export_indicator","openstaande_terugroepactie_indicator","vervaldatum_tachograaf","taxi_indicator","maximum_massa_samenstelling","aantal_rolstoelplaatsen","maximum_ondersteunende_snelheid","jaar_laatste_registratie_tellerstand","tellerstandoordeel","code_toelichting_tellerstandoordeel","tenaamstellen_mogelijk","vervaldatum_apk_dt","datum_tenaamstelling_dt","datum_eerste_toelating_dt","datum_eerste_tenaamstelling_in_nederland_dt","vervaldatum_tachograaf_dt","maximum_last_onder_de_vooras_sen_tezamen_koppeling","type_remsysteem_voertuig_code","rupsonderstelconfiguratiecode","wielbasis_voertuig_minimum","wielbasis_voertuig_maximum","lengte_voertuig_minimum","lengte_voertuig_maximum","breedte_voertuig_minimum","breedte_voertuig_maximum","hoogte_voertuig","hoogte_voertuig_minimum","hoogte_voertuig_maximum","massa_bedrijfsklaar_minimaal","massa_bedrijfsklaar_maximaal","technisch_toelaatbaar_massa_koppelpunt","maximum_massa_technisch_maximaal","maximum_massa_technisch_minimaal","subcategorie_nederland","verticale_belasting_koppelpunt_getrokken_voertuig","zuinigheidsclassificatie","registratie_datum_goedkeuring_afschrijvingsmoment_bpm","registratie_datum_goedkeuring_afschrijvingsmoment_bpm_dt","gem_lading_wrde","aerodyn_voorz","massa_alt_aandr","verl_cab_ind","api_gekentekende_voertuigen_assen","api_gekentekende_voertuigen_brandstof","api_gekentekende_voertuigen_carrosserie","api_gekentekende_voertuigen_carrosserie_specifiek","api_gekentekende_voertuigen_voertuigklasse"
"63ZSL4","Personenauto","MERCEDES-BENZ","B 250","20230125",,"6365","stationwagen","5","GRIJS","Niet geregistreerd","4","1991","1375","2000","1475","735","1500","20130125","20130125","Geen verstrekking in Open Data","43931","Ja",,,,,,,"5","4","0","0",,"0","0","M1",,,"r. bodemplaat by voorzitting","2000","246",,"e1*2007/46*0751*04","M24KP2","MZAAB502","0","0.11","270","Ja","Nee",,"Nee","3500","0","0.00","2021","Logisch","00","Nee","2023-01-25T00:00:00.000",,"2013-01-25T00:00:00.000","2013-01-25T00:00:00.000",,,,,,,,,,,,,,,,,,,,,"B",,,,,,,"https://opendata.rdw.nl/resource/3huj-srit.json","https://opendata.rdw.nl/resource/8ys7-d773.json","https://opendata.rdw.nl/resource/vezc-m2t6.json","https://opendata.rdw.nl/resource/jhie-znh9.json","https://opendata.rdw.nl/resource/kmfi-hrps.json"
"G661NF","Personenauto","MERCEDES-BENZ","B 250 4MATIC","20251108","20240416","10716","stationwagen","5","BLAUW","Niet geregistreerd","4","1991","1455","2105","1555","750","1800","20191108","20191108","Geen verstrekking in Open Data","61862","Ja","250",,,,,,"5","4","0","0",,"443","180","M1",,,,"2105","F2B",,"e1*2007/46*1909*03","O046T1","GZAA150A","0","0.11","273","Ja","Nee",,"Nee","3960","0","0.00","2024","Logisch","00","Nee","2025-11-08T00:00:00.000","2024-04-16T00:00:00.000","2019-11-08T00:00:00.000","2019-11-08T00:00:00.000",,,,,,,,,,,"158",,,,,,,,,,,,,,,,,"https://opendata.rdw.nl/resource/3huj-srit.json","https://opendata.rdw.nl/resource/8ys7-d773.json","https://opendata.rdw.nl/resource/vezc-m2t6.json","https://opendata.rdw.nl/resource/jhie-znh9.json","https://opendata.rdw.nl/resource/kmfi-hrps.json"
"GS972L","Personenauto","MERCEDES-BENZ","B 250","20230918",,"6295","stationwagen","5","GRIJS","Niet geregistreerd","4","1991","1365","1990","1465","730","1500","20150918","20150918","Geen verstrekking in Open Data","41601","Ja",,,,,,,"5","4","0","0",,"0","0","M1",,,"r. bodemplaat by voorzitting","1990","245 G",,"e1*2001/116*0470*13","M24KP2","MZBCB504","0","0.11","270","Ja","Nee",,"Nee","3520","0","0.00","2021","Logisch","00","Nee","2023-09-18T00:00:00.000",,"2015-09-18T00:00:00.000","2015-09-18T00:00:00.000",,,,,,,,,,,,,,,,,,,,,"C",,,,,,,"https://opendata.rdw.nl/resource/3huj-srit.json","https://opendata.rdw.nl/resource/8ys7-d773.json","https://opendata.rdw.nl/resource/vezc-m2t6.json","https://opendata.rdw.nl/resource/jhie-znh9.json","https://opendata.rdw.nl/resource/kmfi-hrps.json"
"GX923N","Personenauto","MERCEDES-BENZ","B 250",,,"5009","stationwagen","5","GRIJS","Niet geregistreerd","4","1991","1365","1990","1465","730","1500","20150518","20150518","Geen verstrekking in Open Data","46265","Ja",,,,,,,"5","4","0","0",,"0","0","M1",,,"by dwarsbalk r. voorzitting","1990","245 G",,"e1*2001/116*0470*13","M24KP2","MZBCB502","0","0.11","270","Ja","Nee",,"Nee","3520","0","0.00","2021","Logisch","00","Nee",,,"2015-05-18T00:00:00.000","2015-05-18T00:00:00.000",,,,,,,,,,,,,,,,,,,,,"C",,,,,,,"https://opendata.rdw.nl/resource/3huj-srit.json","https://opendata.rdw.nl/resource/8ys7-d773.json","https://opendata.rdw.nl/resource/vezc-m2t6.json","https://opendata.rdw.nl/resource/jhie-znh9.json","https://opendata.rdw.nl/resource/kmfi-hrps.json"
"GZ391B","Personenauto","MERCEDES-BENZ","B 250","20231202",,"6295","stationwagen","5","GRIJS","Niet geregistreerd","4","1991","1365","1990","1465","730","1500","20150922","20150922","Geen verstrekking in Open Data","41601","Nee",,,,,,,"5","4","0","0",,"0","0","M1",,,"r. bodemplaat by voorzitting","1990","245 G",,"e1*2001/116*0470*13","M24KP2","MZBCB504","0","0.11","270","Ja","Ja",,"Nee","3520","0","0.00","2022","Logisch","00","Nee","2023-12-02T00:00:00.000",,"2015-09-22T00:00:00.000","2015-09-22T00:00:00.000",,,,,,,,,,,,,,,,,,,,,"C",,,,,,,"https://opendata.rdw.nl/resource/3huj-srit.json","https://opendata.rdw.nl/resource/8ys7-d773.json","https://opendata.rdw.nl/resource/vezc-m2t6.json","https://opendata.rdw.nl/resource/jhie-znh9.json","https://opendata.rdw.nl/resource/kmfi-hrps.json"
"GZ476Z","Personenauto","MERCEDES-BENZ","B 250","20230918",,"6295","stationwagen","5","GRIJS","Niet geregistreerd","4","1991","1365","1990","1465","730","1500","20150918","20150918","Geen verstrekking in Open Data","41601","Ja",,,,,,,"5","4","0","0",,"0","0","M1",,,"r. bodemplaat by voorzitting","1990","245 G",,"e1*2001/116*0470*13","M24KP2","MZBCB504","0","0.11","270","Ja","Nee",,"Nee","3520","0","0.00","2021","Logisch","00","Nee","2023-09-18T00:00:00.000",,"2015-09-18T00:00:00.000","2015-09-18T00:00:00.000",,,,,,,,,,,,,,,,,,,,,"C",,,,,,,"https://opendata.rdw.nl/resource/3huj-srit.json","https://opendata.rdw.nl/resource/8ys7-d773.json","https://opendata.rdw.nl/resource/vezc-m2t6.json","https://opendata.rdw.nl/resource/jhie-znh9.json","https://opendata.rdw.nl/resource/kmfi-hrps.json"
"H608XJ","Personenauto","MERCEDES-BENZ","B 250 E","20240531","20240201",,"stationwagen","5","WIT","Niet geregistreerd",,,"1625","2170","1725",,,"20170227","20200611","Geen verstrekking in Open Data","48495","Nee","160",,,,,,"5","4","0","0",,"436","181","M1",,,,"2170","245 G",,"e1*2001/116*0470*16","Y289Z2","ZZBZ0502","0","0.04","270","Ja","Ja",,"Nee","0","0","0.00","2024","Geen oordeel","05","Nee","2024-05-31T00:00:00.000","2024-02-01T00:00:00.000","2017-02-27T00:00:00.000","2020-06-11T00:00:00.000",,,,,,,,,,,,,,,,,,,,,,,,,,,,"https://opendata.rdw.nl/resource/3huj-srit.json","https://opendata.rdw.nl/resource/8ys7-d773.json","https://opendata.rdw.nl/resource/vezc-m2t6.json","https://opendata.rdw.nl/resource/jhie-znh9.json","https://opendata.rdw.nl/resource/kmfi-hrps.json"
"JB466V","Personenauto","MERCEDES-BENZ","B 250 E","20240302",,,"stationwagen","5","ZWART","Niet geregistreerd",,,"1625","2170","1725",,,"20160218","20160218","Geen verstrekking in Open Data","40624","Nee",,,,,,,"5","4","0","0",,"436","181","M1",,,"onder r. voorzitting","2170","245 G",,"e1*2001/116*0470*15","Y289Z2","ZZBCA501","0","0.04","270","Ja","Nee",,"Nee","0","0","0.00","2023","Niet geregistreerd","NG","Nee","2024-03-02T00:00:00.000",,"2016-02-18T00:00:00.000","2016-02-18T00:00:00.000",,,,,,,,,,,"160",,,,,,,,,,,,,,,,,"https://opendata.rdw.nl/resource/3huj-srit.json","https://opendata.rdw.nl/resource/8ys7-d773.json","https://opendata.rdw.nl/resource/vezc-m2t6.json","https://opendata.rdw.nl/resource/jhie-znh9.json","https://opendata.rdw.nl/resource/kmfi-hrps.json"
"JB611L","Personenauto","MERCEDES-BENZ","B 250 E","20231025",,,"stationwagen","5","ZWART","Niet geregistreerd",,,"1625","2170","1725",,,"20160204","20160204","Geen verstrekking in Open Data","40624","Nee",,,,,,,"5","4","0","0",,"436","181","M1",,,"onder r. voorzitting","2170","245 G",,"e1*2001/116*0470*15","Y289Z2","ZZBCA501","0","0.04","270","Ja","Nee",,"Nee","0","0","0.00","2023","Logisch","00","Nee","2023-10-25T00:00:00.000",,"2016-02-04T00:00:00.000","2016-02-04T00:00:00.000",,,,,,,,,,,"160",,,,,,,,,,,,,,,,,"https://opendata.rdw.nl/resource/3huj-srit.json","https://opendata.rdw.nl/resource/8ys7-d773.json","https://opendata.rdw.nl/resource/vezc-m2t6.json","https://opendata.rdw.nl/resource/jhie-znh9.json","https://opendata.rdw.nl/resource/kmfi-hrps.json"
"JB861R","Personenauto","MERCEDES-BENZ","B 250 E","20240204",,,"stationwagen","5","GRIJS","Niet geregistreerd",,,"1625","2170","1725",,,"20160204","20160204","Geen verstrekking in Open Data","40624","Nee",,,,,,,"5","4","0","0",,"436","0","M1",,,"onder r. voorzitting","2170","245 G",,"e1*2001/116*0470*15","Y289Z2","ZZBCA501","0","0.04","270","Ja","Nee",,"Nee","0","0","0.00","2022","Logisch","00","Nee","2024-02-04T00:00:00.000",,"2016-02-04T00:00:00.000","2016-02-04T00:00:00.000",,,,,,,,,,,,,,,,,,,,,,,,,,,,"https://opendata.rdw.nl/resource/3huj-srit.json","https://opendata.rdw.nl/resource/8ys7-d773.json","https://opendata.rdw.nl/resource/vezc-m2t6.json","https://opendata.rdw.nl/resource/jhie-znh9.json","https://opendata.rdw.nl/resource/kmfi-hrps.json"
"JK216V","Personenauto","MERCEDES-BENZ","B 250 E","20240422",,,"stationwagen","5","GRIJS","Niet geregistreerd",,,"1625","2170","1725",,,"20160422","20160422","Geen verstrekking in Open Data","40624","Nee",,,,,,,"5","4","0","0",,"436","181","M1",,,"onder r. voorzitting","2170","245 G",,"e1*2001/116*0470*15","Y289Z2","ZZBCA501","0","0.04","270","Ja","Nee",,"Nee","0","0","0.00","2023","Logisch","00","Nee","2024-04-22T00:00:00.000",,"2016-04-22T00:00:00.000","2016-04-22T00:00:00.000",,,,,,,,,,,"160",,,,,,,,,,,,,,,,,"https://opendata.rdw.nl/resource/3huj-srit.json","https://opendata.rdw.nl/resource/8ys7-d773.json","https://opendata.rdw.nl/resource/vezc-m2t6.json","https://opendata.rdw.nl/resource/jhie-znh9.json","https://opendata.rdw.nl/resource/kmfi-hrps.json"
"JK670L","Personenauto","MERCEDES-BENZ","B 250 E","20240415",,,"stationwagen","5","GRIJS","Niet geregistreerd",,,"1625","2170","1725",,,"20160415","20160415","Geen verstrekking in Open Data","43608","Nee",,,,,,,"5","4","0","0",,"436","181","M1",,,"onder r. voorzitting","2170","245 G",,"e1*2001/116*0470*15","Y289Z2","ZZBCA50X","0","0.04","270","Ja","Nee",,"Nee","0","0","0.00","2023","Logisch","00","Nee","2024-04-15T00:00:00.000",,"2016-04-15T00:00:00.000","2016-04-15T00:00:00.000",,,,,,,,,,,"160",,,,,,,,,,,,,,,,,"https://opendata.rdw.nl/resource/3huj-srit.json","https://opendata.rdw.nl/resource/8ys7-d773.json","https://opendata.rdw.nl/resource/vezc-m2t6.json","https://opendata.rdw.nl/resource/jhie-znh9.json","https://opendata.rdw.nl/resource/kmfi-hrps.json"
"JP593T","Personenauto","MERCEDES-BENZ","B 250 E","20240811",,,"stationwagen","5","ZWART","Niet geregistreerd",,,"1625","2170","1725",,,"20160620","20160620","Geen verstrekking in Open Data","39995","Nee",,,,,,,"5","4","0","0",,"436","181","M1",,,"onder r. voorzitting","2170","245 G",,"e1*2001/116*0470*15","Y289Z2","ZZBCA501","0","0.04","270","Ja","Nee",,"Nee","0","0","0.00","2023","Onlogisch","04","Nee","2024-08-11T00:00:00.000",,"2016-06-20T00:00:00.000","2016-06-20T00:00:00.000",,,,,,,,,,,"160",,,,,,,,,,,,,,,,,"https://opendata.rdw.nl/resource/3huj-srit.json","https://opendata.rdw.nl/resource/8ys7-d773.json","https://opendata.rdw.nl/resource/vezc-m2t6.json","https://opendata.rdw.nl/resource/jhie-znh9.json","https://opendata.rdw.nl/resource/kmfi-hrps.json"
"K882JL","Personenauto","MERCEDES-BENZ","GLB 250 4MATIC",,"20240314","15802","stationwagen","5","WIT","Niet geregistreerd","4","1991","1570","2205","1670","750","2000","20210105","20210105","Geen verstrekking in Open Data","72012","Ja","236",,,,,,"5","4","0","0",,"465","185","M1",,,,"2205","F2B",,"e1*2007/46*1909*03","OX46T1","JZAA154A","0","0.10","283","Ja","Nee",,"Nee","4290","0","0.00","2024","Logisch","00","Nee",,"2024-03-14T00:00:00.000","2021-01-05T00:00:00.000","2021-01-05T00:00:00.000",,,,,,,,,,,"170",,,,,,,,,,"E",,,,,,,"https://opendata.rdw.nl/resource/3huj-srit.json","https://opendata.rdw.nl/resource/8ys7-d773.json","https://opendata.rdw.nl/resource/vezc-m2t6.json","https://opendata.rdw.nl/resource/jhie-znh9.json","https://opendata.rdw.nl/resource/kmfi-hrps.json"
"KB590K","Personenauto","MERCEDES-BENZ","B 250 E","20240725",,,"stationwagen","5","ZWART","Niet geregistreerd",,,"1625","2170","1725",,,"20160725","20160725","Geen verstrekking in Open Data","47624","Nee",,,,,,,"5","4","0","0",,"436","181","M1",,,"onder r. voorzitting","2170","245 G",,"e1*2001/116*0470*15","Y289Z2","ZZBCA501","0","0.04","270","Ja","Nee",,"Nee","0","0","0.00","2023","Logisch","00","Nee","2024-07-25T00:00:00.000",,"2016-07-25T00:00:00.000","2016-07-25T00:00:00.000",,,,,,,,,,,"160",,,,,,,,,,,,,,,,,"https://opendata.rdw.nl/resource/3huj-srit.json","https://opendata.rdw.nl/resource/8ys7-d773.json","https://opendata.rdw.nl/resource/vezc-m2t6.json","https://opendata.rdw.nl/resource/jhie-znh9.json","https://opendata.rdw.nl/resource/kmfi-hrps.json"
"KG532T","Personenauto","MERCEDES-BENZ","B 250","20230812",,"7348","stationwagen","5","GRIJS","Niet geregistreerd","4","1991","1365","1990","1465","730","1500","20160812","20160812","Geen verstrekking in Open Data","42683","Ja",,,,,,,"5","4","0","0",,"0","0","M1",,,"onder r. voorzitting","1990","245 G",,"e1*2001/116*0470*16","M24KP2","MZBZ1504","0","0.11","270","Ja","Nee",,"Nee","3520","0","0.00","2022","Logisch","00","Nee","2023-08-12T00:00:00.000",,"2016-08-12T00:00:00.000","2016-08-12T00:00:00.000",,,,,,,,,,,,,,,,,,,,,"E",,,,,,,"https://opendata.rdw.nl/resource/3huj-srit.json","https://opendata.rdw.nl/resource/8ys7-d773.json","https://opendata.rdw.nl/resource/vezc-m2t6.json","https://opendata.rdw.nl/resource/jhie-znh9.json","https://opendata.rdw.nl/resource/kmfi-hrps.json"
"KN123K","Personenauto","MERCEDES-BENZ","B 250 E","20241024",,,"stationwagen","5","WIT","Niet geregistreerd",,,"1625","2170","1725",,,"20161024","20161024","Geen verstrekking in Open Data","49394","Nee",,,,,,,"5","4","0","0",,"436","181","M1",,,"onder r. voorzitting","2170","245 G",,"e1*2001/116*0470*16","Y289Z2","ZZBA0502","0","0.04","270","Ja","Nee",,"Nee","0","0","0.00","2023","Logisch","00","Nee","2024-10-24T00:00:00.000",,"2016-10-24T00:00:00.000","2016-10-24T00:00:00.000",,,,,,,,,,,"160",,,,,,,,,,,,,,,,,"https://opendata.rdw.nl/resource/3huj-srit.json","https://opendata.rdw.nl/resource/8ys7-d773.json","https://opendata.rdw.nl/resource/vezc-m2t6.json","https://opendata.rdw.nl/resource/jhie-znh9.json","https://opendata.rdw.nl/resource/kmfi-hrps.json"
"L494NK","Personenauto","MERCEDES-BENZ","GLB 250 4MATIC",,"20240306","14894","stationwagen","5","ZWART","Niet geregistreerd","4","1991","1570","2205","1670","750","2000","20210630","20210630","Geen verstrekking in Open Data","73252","Nee","236",,,,,,"5","4","0","0",,"465","185","M1",,,,"2205","F2B",,"e1*2007/46*1909*10","OX46T1","JZAA150A","0","0.10","283","Ja","Nee",,"Nee","4290","0","0.00","2024","Logisch","00","Nee",,"2024-03-06T00:00:00.000","2021-06-30T00:00:00.000","2021-06-30T00:00:00.000",,,,,,,,,,,"170",,,,,,,,,"100","D",,,,,,,"https://opendata.rdw.nl/resource/3huj-srit.json","https://opendata.rdw.nl/resource/8ys7-d773.json","https://opendata.rdw.nl/resource/vezc-m2t6.json","https://opendata.rdw.nl/resource/jhie-znh9.json","https://opendata.rdw.nl/resource/kmfi-hrps.json"
"L871KZ","Personenauto","MERCEDES-BENZ","B 250 E","20230617",,,"stationwagen","5","GRIJS","Niet geregistreerd",,,"1625","2170","1725",,,"20160308","20220428","Geen verstrekking in Open Data","49923","Nee","160",,,,,,"5","4","0","0",,"436","181","M1",,,,"2170","245 G",,"e1*2001/116*0470*15","Y289Z2","ZZBCA50X","0","0.04","270","Ja","Nee",,"Nee","0","0","0.00","2022","Geen oordeel","05","Nee","2023-06-17T00:00:00.000",,"2016-03-08T00:00:00.000","2022-04-28T00:00:00.000",,,,,,,,,,,,,,,,,,,,,,,,,,,,"https://opendata.rdw.nl/resource/3huj-srit.json","https://opendata.rdw.nl/resource/8ys7-d773.json","https://opendata.rdw.nl/resource/vezc-m2t6.json","https://opendata.rdw.nl/resource/jhie-znh9.json","https://opendata.rdw.nl/resource/kmfi-hrps.json"
"NN891V","Personenauto","MERCEDES-BENZ","B 250 E",,,,"stationwagen","5","ZWART","Niet geregistreerd",,,"1625","2170","1725",,,"20170321","20170321","Geen verstrekking in Open Data","42501","Nee",,,,,,,"5","4","0","0",,"436","0","M1",,,"onder r. voorzitting","2170","245 G",,"e1*2001/116*0470*17","Y289Z2","ZZBA050X","0","0.04","270","Ja","Nee",,"Nee","0","0","0.00","2022","Logisch","00","Nee",,,"2017-03-21T00:00:00.000","2017-03-21T00:00:00.000",,,,,,,,,,,,,,,,,,,,,,,,,,,,"https://opendata.rdw.nl/resource/3huj-srit.json","https://opendata.rdw.nl/resource/8ys7-d773.json","https://opendata.rdw.nl/resource/vezc-m2t6.json","https://opendata.rdw.nl/resource/jhie-znh9.json","https://opendata.rdw.nl/resource/kmfi-hrps.json"
"P574TB","Personenauto","MERCEDES-BENZ","GLB 250 4MATIC",,,"16413","stationwagen","5","GRIJS","Niet geregistreerd","4","1991","1570","2205","1670","750","2000","20220601","20220601","Geen verstrekking in Open Data","68969","Nee","236",,,,,,"5","4","0","0",,"465","185","M1",,,,"2205","F2B",,"e1*2007/46*1909*12","OX46T1","JZAA150A","0","0.10","283","Ja","Nee",,"Nee","4290","0","0.00","2022","Logisch","00","Nee",,,"2022-06-01T00:00:00.000","2022-06-01T00:00:00.000",,,,,,,,,,,"170",,,,,,,,,,"E","20220530","2022-05-30T00:00:00.000",,,,,"https://opendata.rdw.nl/resource/3huj-srit.json","https://opendata.rdw.nl/resource/8ys7-d773.json","https://opendata.rdw.nl/resource/vezc-m2t6.json","https://opendata.rdw.nl/resource/jhie-znh9.json","https://opendata.rdw.nl/resource/kmfi-hrps.json"
"PJ571T","Personenauto","MERCEDES-BENZ","B 250 E","20230711",,,"stationwagen","5","GRIJS","Niet geregistreerd",,,"1625","2170","1725",,,"20170711","20170711","Geen verstrekking in Open Data","52438","Ja",,,,,,,"5","4","0","0",,"436","0","M1",,,"onder r. voorzitting","2170","245 G",,"e1*2001/116*0470*18","Y289Z2","ZZBA0502","0","0.04","270","Ja","Nee",,"Nee","0","0","0.00","2022","Logisch","00","Nee","2023-07-11T00:00:00.000",,"2017-07-11T00:00:00.000","2017-07-11T00:00:00.000",,,,,,,,,,,,,,,,,,,,,,,,,,,,"https://opendata.rdw.nl/resource/3huj-srit.json","https://opendata.rdw.nl/resource/8ys7-d773.json","https://opendata.rdw.nl/resource/vezc-m2t6.json","https://opendata.rdw.nl/resource/jhie-znh9.json","https://opendata.rdw.nl/resource/kmfi-hrps.json"
"PL715J","Personenauto","MERCEDES-BENZ","B 250 E","20230917",,,"stationwagen","5","WIT","Niet geregistreerd",,,"1625","2170","1725",,,"20170807","20170807","Geen verstrekking in Open Data","46995","Nee",,,,,,,"5","4","0","0",,"436","181","M1",,,"onder r. voorzitting","2170","245 G",,"e1*2001/116*0470*16","Y289Z2","ZZBA0501","0","0.04","270","Ja","Nee",,"Nee","0","0","0.00","2023","Logisch","00","Nee","2023-09-17T00:00:00.000",,"2017-08-07T00:00:00.000","2017-08-07T00:00:00.000",,,,,,,,,,,"160",,,,,,,,,,,,,,,,,"https://opendata.rdw.nl/resource/3huj-srit.json","https://opendata.rdw.nl/resource/8ys7-d773.json","https://opendata.rdw.nl/resource/vezc-m2t6.json","https://opendata.rdw.nl/resource/jhie-znh9.json","https://opendata.rdw.nl/resource/kmfi-hrps.json"
"PV943F","Personenauto","MERCEDES-BENZ","B 250 E",,,,"stationwagen","5","WIT","Niet geregistreerd","0",,"1625","2170","1725",,,"20170306","20170926","Geen verstrekking in Open Data","47249","Nee",,,,,,,"5","4","0","0",,"436","0","M1",,,"by dwarsbalk r. voorzitting","2170","245 G",,"e1*2001/116*0470*16","Y289Z2","ZZBA0502","0","0.04","270","Ja","Nee",,"Nee","0","0","0.00","2023","Geen oordeel","05","Nee",,,"2017-03-06T00:00:00.000","2017-09-26T00:00:00.000",,,,,,,,,,,,,,,,,,,,,,,,,,,,"https://opendata.rdw.nl/resource/3huj-srit.json","https://opendata.rdw.nl/resource/8ys7-d773.json","https://opendata.rdw.nl/resource/vezc-m2t6.json","https://opendata.rdw.nl/resource/jhie-znh9.json","https://opendata.rdw.nl/resource/kmfi-hrps.json"
"R187SL","Personenauto","MERCEDES-BENZ","B 250 4 MATIC","20241121",,"39267","hatchback","5","ROOD","Niet geregistreerd","4","1991","1590","2030","1690",,,"20180701","20221124","Geen verstrekking in Open Data","95689","Nee","235",,,,,,"4","4",,,,"444","181","M1",,,,"2030","245 G",,,,,,"0.09","270","Ja","Nee",,"Nee",,,,"2023","Geen oordeel","05","Nee","2024-11-21T00:00:00.000",,"2018-07-01T00:00:00.000","2022-11-24T00:00:00.000",,,,,,,,,,,"157",,,,,,,,,,,"20230828","2023-08-28T00:00:00.000",,,,,"https://opendata.rdw.nl/resource/3huj-srit.json","https://opendata.rdw.nl/resource/8ys7-d773.json","https://opendata.rdw.nl/resource/vezc-m2t6.json","https://opendata.rdw.nl/resource/jhie-znh9.json","https://opendata.rdw.nl/resource/kmfi-hrps.json"
"RS050G","Personenauto","MERCEDES-BENZ","B 250 E","20240115",,,"stationwagen","5","GRIJS","Niet geregistreerd","0",,"1625","2170","1725",,,"20180115","20180115","Geen verstrekking in Open Data","44322","Nee",,,,,,,"5","4","0","0",,"436","0","M1",,,"by dwarsbalk r. voorzitting","2170","245 G",,"e1*2001/116*0470*18","Y289Z2","ZZBA050X","0","0.04","270","Ja","Nee",,"Nee","0","0","0.00","2023","Logisch","00","Nee","2024-01-15T00:00:00.000",,"2018-01-15T00:00:00.000","2018-01-15T00:00:00.000",,,,,,,,,,,,,,,,,,,,,,,,,,,,"https://opendata.rdw.nl/resource/3huj-srit.json","https://opendata.rdw.nl/resource/8ys7-d773.json","https://opendata.rdw.nl/resource/vezc-m2t6.json","https://opendata.rdw.nl/resource/jhie-znh9.json","https://opendata.rdw.nl/resource/kmfi-hrps.json"
"S713LT","Personenauto","MERCEDES-BENZ","EQB 250",,"20240216",,"stationwagen","5","GRIJS","Niet geregistreerd",,,"2010","2520","2110",,,"20230314","20230314","Geen verstrekking in Open Data","68588","Ja","160",,,,,,"5","4",,,,"469","183","M1",,,,"2520","F2B",,"e1*2007/46*1909*19","OYEUZ2","ZZAAA50A","0","0.05","283","Ja","Nee",,"Nee",,,,"2024","Logisch","00","Nee",,"2024-02-16T00:00:00.000","2023-03-14T00:00:00.000","2023-03-14T00:00:00.000",,,,,,,,,,,"170",,,,,,,,,,,"20230224","2023-02-24T00:00:00.000",,,,,"https://opendata.rdw.nl/resource/3huj-srit.json","https://opendata.rdw.nl/resource/8ys7-d773.json","https://opendata.rdw.nl/resource/vezc-m2t6.json","https://opendata.rdw.nl/resource/jhie-znh9.json","https://opendata.rdw.nl/resource/kmfi-hrps.json"