"kenteken","voertuigsoort","merk","handelsbenaming","vervaldatum_apk","datum_tenaamstelling","bruto_bpm","inrichting","aantal_zitplaatsen","eerste_kleur","tweede_kleur","aantal_cilinders","cilinderinhoud","massa_ledig_voertuig","toegestane_maximum_massa_voertuig","massa_rijklaar","maximum_massa_trekken_ongeremd","maximum_trekken_massa_geremd","datum_eerste_toelating","datum_eerste_tenaamstelling_in_nederland","wacht_op_keuren","catalogusprijs","wam_verzekerd","maximale_constructiesnelheid","laadvermogen","oplegger_geremd","aanhangwagen_autonoom_geremd","aanhangwagen_middenas_geremd","aantal_staanplaatsen","aantal_deuren","aantal_wielen","afstand_hart_koppeling_tot_achterzijde_voertuig","afstand_voorzijde_voertuig_tot_hart_koppeling","afwijkende_maximum_snelheid","lengte","breedte","europese_voertuigcategorie","europese_voertuigcategorie_toevoeging","europese_uitvoeringcategorie_toevoeging","plaats_chassisnummer","technische_max_massa_voertuig","type","type_gasinstallatie","typegoedkeuringsnummer","variant","uitvoering","volgnummer_wijziging_eu_typegoedkeuring","vermogen_massarijklaar","wielbasis","export_indicator","openstaande_terugroepactie_indicator","vervaldatum_tachograaf","taxi_indicator","maximum_massa_samenstelling","aantal_rolstoelplaatsen","maximum_ondersteunende_snelheid","jaar_laatste_registratie_tellerstand","tellerstandoordeel","code_toelichting_tellerstandoordeel","tenaamstellen_mogelijk","vervaldatum_apk_dt","datum_tenaamstelling_dt","datum_eerste_toelating_dt","datum_eerste_tenaamstelling_in_nederland_dt","vervaldatum_tachograaf_dt","maximum_last_onder_de_vooras_sen_tezamen_koppeling","type_remsysteem_voertuig_code","rupsonderstelconfiguratiecode","wielbasis_voertuig_minimum","wielbasis_voertuig_maximum","lengte_voertuig_minimum","lengte_voertuig_maximum","breedte_voertuig_minimum","breedte_voertuig_maximum","hoogte_voertuig","hoogte_voertuig_minimum","hoogte_voertuig_maximum","massa_bedrijfsklaar_minimaal","massa_bedrijfsklaar_maximaal","technisch_toelaatbaar_massa_koppelpunt","maximum_massa_technisch_maximaal","maximum_massa_technisch_minimaal","subcategorie_nederland","verticale_belasting_koppelpunt_getrokken_voertuig","zuinigheidsclassificatie","registratie_datum_goedkeuring_afschrijvingsmoment_bpm","registratie_datum_goedkeuring_afschrijvingsmoment_bpm_dt","gem_lading_wrde","aerodyn_voorz","massa_alt_aandr","verl_cab_ind","api_gekentekende_voertuigen_assen","api_gekentekende_voertuigen_brandstof","api_gekentekende_voertuigen_carrosserie","api_gekentekende_voertuigen_carrosserie_specifiek","api_gekentekende_voertuigen_voertuigklasse"
"G037SG","Personenauto","MERCEDES-BENZ","B 200 D","20240630",,"4316","stationwagen","5","ZWART","Niet geregistreerd","4","2143","1405","2025","1505","750","1500","20160714","20191119","Geen verstrekking in Open Data","47565","Nee","210",,,,,,"5","4","0","0",,"0","0","M1",,,,"2025","245 G",,"e1*2001/116*0470*16","M2S1P2","MZBZ1502","0","0.07","270","Ja","Nee",,"Nee","3560","0","0.00","2023","Geen oordeel","05","Nee","2024-06-30T00:00:00.000",,"2016-07-14T00:00:00.000","2019-11-19T00:00:00.000",,,,,,,,,,,,,,,,,,,,,"E",,,,,,,"https://opendata.rdw.nl/resource/3huj-srit.json","https://opendata.rdw.nl/resource/8ys7-d773.json","https://opendata.rdw.nl/resource/vezc-m2t6.json","https://opendata.rdw.nl/resource/jhie-znh9.json","https://opendata.rdw.nl/resource/kmfi-hrps.json"
"G728HK","Personenauto","MERCEDES-BENZ","B 200 D","20240930",,"9337","stationwagen","5","GRIJS","Niet geregistreerd","4","1950","1435","2065","1535","750","1600","20190930","20190930","Geen verstrekking in Open Data","58807","Nee","219",,,,,,"5","4","0","0",,"443","180","M1",,,,"2065","F2B",,"e1*2007/46*1909*03","O01CT2","HZAZ150A","0","0.07","273","Ja","Nee",,"Nee","3755","0","0.00","2023","Logisch","00","Nee","2024-09-30T00:00:00.000",,"2019-09-30T00:00:00.000","2019-09-30T00:00:00.000",,,,,,,,,,,"158",,,,,,,,,,,,,,,,,"https://opendata.rdw.nl/resource/3huj-srit.json","https://opendata.rdw.nl/resource/8ys7-d773.json","https://opendata.rdw.nl/resource/vezc-m2t6.json","https://opendata.rdw.nl/resource/jhie-znh9.json","https://opendata.rdw.nl/resource/kmfi-hrps.json"
"H982SN","Personenauto","MERCEDES-BENZ","GLB 200 D","20231129",,"13050","stationwagen","5","ZWART","Niet geregistreerd","4","1950","1580","2195","1680","750","1800","20200506","20200506","Geen verstrekking in Open Data","60427","Nee","204",,,,,,"5","4","0","0",,"465","185","M1",,,,"2195","F2B",,"e1*2007/46*1909*05","OX1CT2","JZAZ150A","0","0.07","283","Ja","Nee",,"Nee","4095","0","0.00","2022","Logisch","00","Nee","2023-11-29T00:00:00.000",,"2020-05-06T00:00:00.000","2020-05-06T00:00:00.000",,,,,,,,,,,"170",,,,,,,,,,"C",,,,,,,"https://opendata.rdw.nl/resource/3huj-srit.json","https://opendata.rdw.nl/resource/8ys7-d773.json","https://opendata.rdw.nl/resource/vezc-m2t6.json","https://opendata.rdw.nl/resource/jhie-znh9.json","https://opendata.rdw.nl/resource/kmfi-hrps.json"
"HB649F","Personenauto","MERCEDES-BENZ","B 200 D","20231001",,"5419","stationwagen","5","GRIJS","Niet geregistreerd","4","2143","1405","2025","1505","750","1500","20151001","20151001","Geen verstrekking in Open Data","46846","Nee",,,,,,,"5","4","0","0",,"0","0","M1",,,"r. bodemplaat by voorzitting","2025","245 G",,"e1*2001/116*0470*15","M2S1P2","MZBCA502","0","0.07","270","Ja","Nee",,"Nee","3560","0","0.00","2023","Logisch","00","Nee","2023-10-01T00:00:00.000",,"2015-10-01T00:00:00.000","2015-10-01T00:00:00.000",,,,,,,,,,,,,,,,,,,,,"C",,,,,,,"https://opendata.rdw.nl/resource/3huj-srit.json","https://opendata.rdw.nl/resource/8ys7-d773.json","https://opendata.rdw.nl/resource/vezc-m2t6.json","https://opendata.rdw.nl/resource/jhie-znh9.json","https://opendata.rdw.nl/resource/kmfi-hrps.json"
"HB790J","Personenauto","MERCEDES-BENZ","B 200 D","20220930",,"6435","stationwagen","5","ZWART","Niet geregistreerd","4","2143","1385","2025","1485","740","1500","20150930","20150930","Geen verstrekking in Open Data","49647","Nee",,,,,,,"5","4","0","0",,"0","0","M1",,,"r. bodemplaat by voorzitting","2025","245 G",,"e1*2001/116*0470*15","M2S1P2","WZBCA502","0","0.07","270","Ja","Nee",,"Nee","3540","0","0.00","2022","Logisch","00","Nee","2022-09-30T00:00:00.000",,"2015-09-30T00:00:00.000","2015-09-30T00:00:00.000",,,,,,,,,,,,,,,,,,,,,"D",,,,,,,"https://opendata.rdw.nl/resource/3huj-srit.json","https://opendata.rdw.nl/resource/8ys7-d773.json","https://opendata.rdw.nl/resource/vezc-m2t6.json","https://opendata.rdw.nl/resource/jhie-znh9.json","https://opendata.rdw.nl/resource/kmfi-hrps.json"
"J099XF","Personenauto","MERCEDES-BENZ","GLB 200 D",,,"11265","stationwagen","7","ZWART","Niet geregistreerd","4","1950","1580","2390","1680","750","1800","20201104","20201104","Geen verstrekking in Open Data","61507","Ja","204",,,,,,"5","4","0","0",,"465","185","M1",,,,"2390","F2B",,"e1*2007/46*1909*06","OX1CT2","JZAA070A","0","0.07","283","Ja","Nee",,"Nee","4290","0","0.00","2023","Logisch","00","Nee",,,"2020-11-04T00:00:00.000","2020-11-04T00:00:00.000",,,,,,,,,,,"170",,,,,,,,,,"D",,,,,,,"https://opendata.rdw.nl/resource/3huj-srit.json","https://opendata.rdw.nl/resource/8ys7-d773.json","https://opendata.rdw.nl/resource/vezc-m2t6.json","https://opendata.rdw.nl/resource/jhie-znh9.json","https://opendata.rdw.nl/resource/kmfi-hrps.json"
"J288PL","Personenauto","MERCEDES-BENZ","GLB 200 D","20240929","20240205","11265","stationwagen","5","ZWART","Niet geregistreerd","4","1950","1580","2195","1680","750","1800","20200929","20200929","Geen verstrekking in Open Data","61023","Ja","204",,,,,,"5","4","0","0",,"465","185","M1",,,,"2195","F2B",,"e1*2007/46*1909*06","OX1CT2","JZAA050A","0","0.07","283","Ja","Nee",,"Nee","4095","0","0.00","2024","Onlogisch","04","Nee","2024-09-29T00:00:00.000","2024-02-05T00:00:00.000","2020-09-29T00:00:00.000","2020-09-29T00:00:00.000",,,,,,,,,,,"170",,,,,,,,,,"D",,,,,,,"https://opendata.rdw.nl/resource/3huj-srit.json","https://opendata.rdw.nl/resource/8ys7-d773.json","https://opendata.rdw.nl/resource/vezc-m2t6.json","https://opendata.rdw.nl/resource/jhie-znh9.json","https://opendata.rdw.nl/resource/kmfi-hrps.json"
"J416DJ","Personenauto","MERCEDES-BENZ","B 200 D","20240825",,"1225","stationwagen","5","BRUIN","Niet geregistreerd","4","2143","1405","2025","1505","750","1500","20161202","20200701","Geen verstrekking in Open Data","40887","Nee","210",,,,,,"5","4","0","0",,"0","0","M1",,,,"2025","245 G",,"e1*2001/116*0470*16","M2S1P2","MZBA1502","0","0.07","270","Ja","Ja",,"Nee","3560","0","0.00","2024","Geen oordeel","05","Nee","2024-08-25T00:00:00.000",,"2016-12-02T00:00:00.000","2020-07-01T00:00:00.000",,,,,,,,,,,,,,,,,,,,,"E",,,,,,,"https://opendata.rdw.nl/resource/3huj-srit.json","https://opendata.rdw.nl/resource/8ys7-d773.json","https://opendata.rdw.nl/resource/vezc-m2t6.json","https://opendata.rdw.nl/resource/jhie-znh9.json","https://opendata.rdw.nl/resource/kmfi-hrps.json"
"J468VP","Personenauto","MERCEDES-BENZ","B 200 D","20230801",,"5209","stationwagen","5","ZWART","Niet geregistreerd","4","1950","1435","2055","1535","750","1600","20190801","20201113","Geen verstrekking in Open Data","51360","Nee","219",,,,,,"5","4","0","0",,"0","180","M1",,,,"2055","F2B",,"e1*2007/46*1909*01","O01CT2","HZAA150A","0","0.07","273","Ja","Nee",,"Nee","3755","0","0.00","2023","Geen oordeel","05","Nee","2023-08-01T00:00:00.000",,"2019-08-01T00:00:00.000","2020-11-13T00:00:00.000",,,,,,,,,,,,,,,,,,,,,,,,,,,,"https://opendata.rdw.nl/resource/3huj-srit.json","https://opendata.rdw.nl/resource/8ys7-d773.json","https://opendata.rdw.nl/resource/vezc-m2t6.json","https://opendata.rdw.nl/resource/jhie-znh9.json","https://opendata.rdw.nl/resource/kmfi-hrps.json"
"J759TR","Personenauto","MERCEDES-BENZ","GLB 200 D","20241023","20240412","11468","stationwagen","5","ZWART","Niet geregistreerd","4","1950","1580","2195","1680","750","1800","20201023","20201023","Geen verstrekking in Open Data","66181","Ja","204",,,,,,"5","4","0","0",,"465","185","M1",,,,"2195","F2B",,"e1*2007/46*1909*06","OX1CT2","JZAZ050A","0","0.07","283","Ja","Nee",,"Nee","4095","0","0.00","2024","Logisch","00","Nee","2024-10-23T00:00:00.000","2024-04-12T00:00:00.000","2020-10-23T00:00:00.000","2020-10-23T00:00:00.000",,,,,,,,,,,"170",,,,,,,,,,"D",,,,,,,"https://opendata.rdw.nl/resource/3huj-srit.json","https://opendata.rdw.nl/resource/8ys7-d773.json","https://opendata.rdw.nl/resource/vezc-m2t6.json","https://opendata.rdw.nl/resource/jhie-znh9.json","https://opendata.rdw.nl/resource/kmfi-hrps.json"
"JD190G","Personenauto","MERCEDES-BENZ","B 200 D","20240804",,"5571","stationwagen","5","WIT","Niet geregistreerd","4","2143","1405","2025","1505","750","1500","20160218","20160218","Geen verstrekking in Open Data","43790","Nee",,,,,,,"5","4","0","0",,"444","181","M1",,,"onder r. voorzitting","2025","245 G",,"e1*2001/116*0470*15","M2S1P2","MZBCA501","0","0.07","270","Ja","Nee",,"Nee","3560","0","0.00","2023","Logisch","00","Nee","2024-08-04T00:00:00.000",,"2016-02-18T00:00:00.000","2016-02-18T00:00:00.000",,,,,,,,,,,"157",,,,,,,,,,"E",,,,,,,"https://opendata.rdw.nl/resource/3huj-srit.json","https://opendata.rdw.nl/resource/8ys7-d773.json","https://opendata.rdw.nl/resource/vezc-m2t6.json","https://opendata.rdw.nl/resource/jhie-znh9.json","https://opendata.rdw.nl/resource/kmfi-hrps.json"
"JG371S","Personenauto","MERCEDES-BENZ","B 200 D","20240316",,"5882","stationwagen","5","GRIJS","Niet geregistreerd","4","2143","1405","2025","1505","750","1500","20160316","20160316","Geen verstrekking in Open Data","48390","Nee",,,,,,,"5","4","0","0",,"444","181","M1",,,"onder r. voorzitting","2025","245 G",,"e1*2001/116*0470*15","M2S1P2","MZBCA502","0","0.07","270","Ja","Nee",,"Nee","3560","0","0.00","2023","Logisch","00","Nee","2024-03-16T00:00:00.000",,"2016-03-16T00:00:00.000","2016-03-16T00:00:00.000",,,,,,,,,,,"157",,,,,,,,,,"E",,,,,,,"https://opendata.rdw.nl/resource/3huj-srit.json","https://opendata.rdw.nl/resource/8ys7-d773.json","https://opendata.rdw.nl/resource/vezc-m2t6.json","https://opendata.rdw.nl/resource/jhie-znh9.json","https://opendata.rdw.nl/resource/kmfi-hrps.json"
"JN418J","Personenauto","MERCEDES-BENZ","B 200 D","20231212",,"5882","stationwagen","5","WIT","Niet geregistreerd","4","2143","1405","2025","1505","750","1500","20160503","20160503","Geen verstrekking in Open Data","47126","Ja",,,,,,,"5","4","0","0",,"444","181","M1",,,"onder r. voorzitting","2025","245 G",,"e1*2001/116*0470*15","M2S1P2","MZBCA502","0","0.07","270","Ja","Nee",,"Nee","3560","0","0.00","2023","Logisch","00","Nee","2023-12-12T00:00:00.000",,"2016-05-03T00:00:00.000","2016-05-03T00:00:00.000",,,,,,,,,,,"157",,,,,,,,,,"E",,,,,,,"https://opendata.rdw.nl/resource/3huj-srit.json","https://opendata.rdw.nl/resource/8ys7-d773.json","https://opendata.rdw.nl/resource/vezc-m2t6.json","https://opendata.rdw.nl/resource/jhie-znh9.json","https://opendata.rdw.nl/resource/kmfi-hrps.json"
"K031GJ","Personenauto","MERCEDES-BENZ","GLB 200 D",,,"11265","stationwagen","5","WIT","Niet geregistreerd","4","1950","1580","2195","1680","750","1800","20210106","20210106","Geen verstrekking in Open Data","61858","Nee","204",,,,,,"5","4","0","0",,"465","185","M1",,,,"2195","F2B",,"e1*2007/46*1909*06","OX1CT2","JZAA050A","0","0.07","283","Ja","Nee",,"Nee","4095","0","0.00","2022","Logisch","00","Nee",,,"2021-01-06T00:00:00.000","2021-01-06T00:00:00.000",,,,,,,,,,,"170",,,,,,,,,,"D",,,,,,,"https://opendata.rdw.nl/resource/3huj-srit.json","https://opendata.rdw.nl/resource/8ys7-d773.json","https://opendata.rdw.nl/resource/vezc-m2t6.json","https://opendata.rdw.nl/resource/jhie-znh9.json","https://opendata.rdw.nl/resource/kmfi-hrps.json"
"K220PF","Personenauto","MERCEDES-BENZ","GLB 200 D","20240116",,"12345","stationwagen","5","ZWART","Niet geregistreerd","4","1950","1580","2195","1680","750","1800","20210128","20210128","Geen verstrekking in Open Data","57750","Nee","204",,,,,,"5","4","0","0",,"465","185","M1",,,,"2195","F2B",,"e1*2007/46*1909*08","OX1CT2","JZAA150A","0","0.07","283","Ja","Nee",,"Nee","4095","0","0.00","2023","Logisch","00","Nee","2024-01-16T00:00:00.000",,"2021-01-28T00:00:00.000","2021-01-28T00:00:00.000",,,,,,,,,,,"170",,,,,,,,,,"C",,,,,,,"https://opendata.rdw.nl/resource/3huj-srit.json","https://opendata.rdw.nl/resource/8ys7-d773.json","https://opendata.rdw.nl/resource/vezc-m2t6.json","https://opendata.rdw.nl/resource/jhie-znh9.json","https://opendata.rdw.nl/resource/kmfi-hrps.json"
"K806XV","Personenauto","MERCEDES-BENZ","GLB 200 D",,,"12561","stationwagen","5","GRIJS","Niet geregistreerd","4","1950","1580","2195","1680","750","1800","20210330","20210330","Geen verstrekking in Open Data","65310","Nee","204",,,,,,"5","4","0","0",,"465","185","M1",,,,"2195","F2B",,"e1*2007/46*1909*03","OX1CT2","JZAZ150A","0","0.07","283","Ja","Nee",,"Nee","4095","0","0.00","2023","Logisch","00","Nee",,,"2021-03-30T00:00:00.000","2021-03-30T00:00:00.000",,,,,,,,,,,"170",,,,,,,,,,"D",,,,,,,"https://opendata.rdw.nl/resource/3huj-srit.json","https://opendata.rdw.nl/resource/8ys7-d773.json","https://opendata.rdw.nl/resource/vezc-m2t6.json","https://opendata.rdw.nl/resource/jhie-znh9.json","https://opendata.rdw.nl/resource/kmfi-hrps.json"
"K884JL","Personenauto","MERCEDES-BENZ","GLB 200 D",,,"11062","stationwagen","5","GRIJS","Niet geregistreerd","4","1950","1580","2195","1680","750","1800","20210128","20210128","Geen verstrekking in Open Data","63811","Nee","204",,,,,,"5","4","0","0",,"465","185","M1",,,,"2195","F2B",,"e1*2007/46*1909*03","OX1CT2","JZAZ150A","0","0.07","283","Ja","Nee",,"Nee","4095","0","0.00","2023","Logisch","00","Nee",,,"2021-01-28T00:00:00.000","2021-01-28T00:00:00.000",,,,,,,,,,,"170",,,,,,,,,,"D",,,,,,,"https://opendata.rdw.nl/resource/3huj-srit.json","https://opendata.rdw.nl/resource/8ys7-d773.json","https://opendata.rdw.nl/resource/vezc-m2t6.json","https://opendata.rdw.nl/resource/jhie-znh9.json","https://opendata.rdw.nl/resource/kmfi-hrps.json"
"KB527N","Personenauto","MERCEDES-BENZ","B 200 D","20240727","20240408","5882","stationwagen","5","WIT","Niet geregistreerd","4","2143","1405","2025","1505","750","1500","20160727","20160727","Geen verstrekking in Open Data","47424","Ja",,,,,,,"5","4","0","0",,"444","181","M1",,,"onder r. voorzitting","2025","245 G",,"e1*2001/116*0470*16","M2S1P2","MZBZ1502","0","0.07","270","Ja","Nee",,"Nee","3560","0","0.00","2024","Logisch","00","Nee","2024-07-27T00:00:00.000","2024-04-08T00:00:00.000","2016-07-27T00:00:00.000","2016-07-27T00:00:00.000",,,,,,,,,,,"157",,,,,,,,,,"E",,,,,,,"https://opendata.rdw.nl/resource/3huj-srit.json","https://opendata.rdw.nl/resource/8ys7-d773.json","https://opendata.rdw.nl/resource/vezc-m2t6.json","https://opendata.rdw.nl/resource/jhie-znh9.json","https://opendata.rdw.nl/resource/kmfi-hrps.json"
"KL905P","Personenauto","MERCEDES-BENZ","B 200 D","20231013",,"5571","stationwagen","5","GRIJS","Niet geregistreerd","4","2143","1405","2025","1505","750","1500","20161013","20161013","Geen verstrekking in Open Data","48581","Nee",,,,,,,"5","4","0","0",,"444","181","M1",,,"onder r. voorzitting","2025","245 G",,"e1*2001/116*0470*16","M2S1P2","MZBA1501","0","0.07","270","Ja","Nee",,"Nee","3560","0","0.00","2022","Onlogisch","04","Nee","2023-10-13T00:00:00.000",,"2016-10-13T00:00:00.000","2016-10-13T00:00:00.000",,,,,,,,,,,"157",,,,,,,,,,"E",,,,,,,"https://opendata.rdw.nl/resource/3huj-srit.json","https://opendata.rdw.nl/resource/8ys7-d773.json","https://opendata.rdw.nl/resource/vezc-m2t6.json","https://opendata.rdw.nl/resource/jhie-znh9.json","https://opendata.rdw.nl/resource/kmfi-hrps.json"
"KX609V","Personenauto","MERCEDES-BENZ","B 200 D","20241227","20240228","5571","stationwagen","5","ZWART","Niet geregistreerd","4","2143","1405","2025","1505","750","1500","20161222","20161222","Geen verstrekking in Open Data","44745","Ja",,,,,,,"5","4","0","0",,"444","181","M1",,,"onder r. voorzitting","2025","245 G",,"e1*2001/116*0470*16","M2S1P2","MZBA1501","0","0.07","270","Ja","Nee",,"Nee","3560","0","0.00","2024","Logisch","00","Nee","2024-12-27T00:00:00.000","2024-02-28T00:00:00.000","2016-12-22T00:00:00.000","2016-12-22T00:00:00.000",,,,,,,,,,,"157",,,,,,,,,,"E",,,,,,,"https://opendata.rdw.nl/resource/3huj-srit.json","https://opendata.rdw.nl/resource/8ys7-d773.json","https://opendata.rdw.nl/resource/vezc-m2t6.json","https://opendata.rdw.nl/resource/jhie-znh9.json","https://opendata.rdw.nl/resource/kmfi-hrps.json"
"KZ007K","Personenauto","MERCEDES-BENZ","B 200 D","20240814",,"5100","stationwagen","5","GRIJS","Niet geregistreerd","4","2143","1405","2025","1505","750","1500","20151020","20161230","Geen verstrekking in Open Data","44255","Nee",,,,,,,"5","4","0","0",,"0","0","M1",,,"r. bodemplaat by voorzitting","2025","245 G",,"e1*2001/116*0470*15","M2S1P2","MZBCA502","0","0.07","270","Ja","Nee",,"Nee","3560","0","0.00","2023","Geen oordeel","05","Nee","2024-08-14T00:00:00.000",,"2015-10-20T00:00:00.000","2016-12-30T00:00:00.000",,,,,,,,,,,,,,,,,,,,,"C",,,,,,,"https://opendata.rdw.nl/resource/3huj-srit.json","https://opendata.rdw.nl/resource/8ys7-d773.json","https://opendata.rdw.nl/resource/vezc-m2t6.json","https://opendata.rdw.nl/resource/jhie-znh9.json","https://opendata.rdw.nl/resource/kmfi-hrps.json"
"L330HX","Personenauto","MERCEDES-BENZ","GLB 200 D",,,"7412","stationwagen","5","GRIJS","Niet geregistreerd","4","1950","1580","2195","1680","750","1800","20200507","20210528","Geen verstrekking in Open Data","59906","Nee","204",,,,,,"5","4","0","0",,"0","0","M1",,,,"2195","F2B",,"e1*2007/46*1909*03","OX1CT2","JZAZ150A","0","0.07","283","Ja","Nee",,"Nee","4095","0","0.00","2023","Geen oordeel","05","Nee",,,"2020-05-07T00:00:00.000","2021-05-28T00:00:00.000",,,,,,,,,,,,,,,,,,,,,,,,,,,,"https://opendata.rdw.nl/resource/3huj-srit.json","https://opendata.rdw.nl/resource/8ys7-d773.json","https://opendata.rdw.nl/resource/vezc-m2t6.json","https://opendata.rdw.nl/resource/jhie-znh9.json","https://opendata.rdw.nl/resource/kmfi-hrps.json"
"NL141P","Personenauto","MERCEDES-BENZ","B 200 D","20231231",,"4537","stationwagen","5","GRIJS","Niet geregistreerd","4","2143","1385","2025","1485","740","1500","20151209","20170302","Geen verstrekking in Open Data","45032","Nee",,,,,,,"5","4","0","0",,"0","0","M1",,,"by dwarsbalk r. voorzitting","2025","245 G",,"e1*2001/116*0470*15","M2S1P2","WZBCA502","0","0.07","270","Ja","Nee",,"Nee","3540","0","0.00","2023","Geen oordeel","05","Nee","2023-12-31T00:00:00.000",,"2015-12-09T00:00:00.000","2017-03-02T00:00:00.000",,,,,,,,,,,,,,,,,,,,,"D",,,,,,,"https://opendata.rdw.nl/resource/3huj-srit.json","https://opendata.rdw.nl/resource/8ys7-d773.json","https://opendata.rdw.nl/resource/vezc-m2t6.json","https://opendata.rdw.nl/resource/jhie-znh9.json","https://opendata.rdw.nl/resource/kmfi-hrps.json"
"NT044F","Personenauto","MERCEDES-BENZ","B 200 D","20231128",,"6355","stationwagen","5","BLAUW","Niet geregistreerd","4","2143","1405","2025","1505","750","1500","20170413","20170413","Geen verstrekking in Open Data","44168","Nee",,,,,,,"5","4","0","0",,"444","181","M1",,,"onder r. voorzitting","2025","245 G",,"e1*2001/116*0470*17","M2S1P2","MZBA1502","0","0.07","270","Ja","Nee",,"Nee","3560","0","0.00","2023","Logisch","00","Nee","2023-11-28T00:00:00.000",,"2017-04-13T00:00:00.000","2017-04-13T00:00:00.000",,,,,,,,,,,"157",,,,,,,,,,"E",,,,,,,"https://opendata.rdw.nl/resource/3huj-srit.json","https://opendata.rdw.nl/resource/8ys7-d773.json","https://opendata.rdw.nl/resource/vezc-m2t6.json","https://opendata.rdw.nl/resource/jhie-znh9.json","https://opendata.rdw.nl/resource/kmfi-hrps.json"
"NZ354G","Personenauto","MERCEDES-BENZ","B 200 D","20240906","20240404","6355","stationwagen","5","ZWART","Niet geregistreerd","4","2143","1405","2025","1505","750","1500","20170516","20170516","Geen verstrekking in Open Data","44168","Ja",,,,,,,"5","4","0","0",,"444","181","M1",,,"onder r. voorzitting","2025","245 G",,"e1*2001/116*0470*18","M2S1P2","MZBA1502","0","0.07","270","Ja","Nee",,"Nee","3560","0","0.00","2024","Logisch","00","Nee","2024-09-06T00:00:00.000","2024-04-04T00:00:00.000","2017-05-16T00:00:00.000","2017-05-16T00:00:00.000",,,,,,,,,,,"157",,,,,,,,,,"E",,,,,,,"https://opendata.rdw.nl/resource/3huj-srit.json","https://opendata.rdw.nl/resource/8ys7-d773.json","https://opendata.rdw.nl/resource/vezc-m2t6.json","https://opendata.rdw.nl/resource/jhie-znh9.json","https://opendata.rdw.nl/resource/kmfi-hrps.json"
"P799TX","Personenauto","MERCEDES-BENZ","B 200 D 4MATIC","20231109",,"1843","stationwagen","5","GRIJS","Niet geregistreerd","4","2143","1475","2095","1575","750","1500","20151109","20220610","Geen verstrekking in Open Data","57864","Nee","207",,,,,,"5","4","0","0",,"444","181","M1",,,"by dwarsbalk r. voorzitting","2095","245 G",,"e1*2001/116*0470*15","M2S1P1","MZBCA502","0","0.06","270","Ja","Nee",,"Nee","3630","0","0.00","2023","Niet geregistreerd","NG","Nee","2023-11-09T00:00:00.000",,"2015-11-09T00:00:00.000","2022-06-10T00:00:00.000",,,,,,,,,,,"157",,,,,,,,,,,"20220531","2022-05-31T00:00:00.000",,,,,"https://opendata.rdw.nl/resource/3huj-srit.json","https://opendata.rdw.nl/resource/8ys7-d773.json","https://opendata.rdw.nl/resource/vezc-m2t6.json","https://opendata.rdw.nl/resource/jhie-znh9.json","https://opendata.rdw.nl/resource/kmfi-hrps.json"
"PG489T","Personenauto","MERCEDES-BENZ","B 200 D","20230630",,"6355","stationwagen","5","BLAUW","Niet geregistreerd","4","2143","1405","2025","1505","750","1500","20170630","20170630","Geen verstrekking in Open Data","46286","Nee",,,,,,,"5","4","0","0",,"0","0","M1",,,"onder r. voorzitting","2025","245 G",,"e1*2001/116*0470*18","M2S1P2","MZBA1502","0","0.07","270","Ja","Nee",,"Nee","3560","0","0.00","2022","Logisch","00","Nee","2023-06-30T00:00:00.000",,"2017-06-30T00:00:00.000","2017-06-30T00:00:00.000",,,,,,,,,,,,,,,,,,,,,"E",,,,,,,"https://opendata.rdw.nl/resource/3huj-srit.json","https://opendata.rdw.nl/resource/8ys7-d773.json","https://opendata.rdw.nl/resource/vezc-m2t6.json","https://opendata.rdw.nl/resource/jhie-znh9.json","https://opendata.rdw.nl/resource/kmfi-hrps.json"