"kenteken","voertuigsoort","merk","handelsbenaming","vervaldatum_apk","datum_tenaamstelling","bruto_bpm","inrichting","aantal_zitplaatsen","eerste_kleur","tweede_kleur","aantal_cilinders","cilinderinhoud","massa_ledig_voertuig","toegestane_maximum_massa_voertuig","massa_rijklaar","maximum_massa_trekken_ongeremd","maximum_trekken_massa_geremd","datum_eerste_toelating","datum_eerste_tenaamstelling_in_nederland","wacht_op_keuren","catalogusprijs","wam_verzekerd","maximale_constructiesnelheid","laadvermogen","oplegger_geremd","aanhangwagen_autonoom_geremd","aanhangwagen_middenas_geremd","aantal_staanplaatsen","aantal_deuren","aantal_wielen","afstand_hart_koppeling_tot_achterzijde_voertuig","afstand_voorzijde_voertuig_tot_hart_koppeling","afwijkende_maximum_snelheid","lengte","breedte","europese_voertuigcategorie","europese_voertuigcategorie_toevoeging","europese_uitvoeringcategorie_toevoeging","plaats_chassisnummer","technische_max_massa_voertuig","type","type_gasinstallatie","typegoedkeuringsnummer","variant","uitvoering","volgnummer_wijziging_eu_typegoedkeuring","vermogen_massarijklaar","wielbasis","export_indicator","openstaande_terugroepactie_indicator","vervaldatum_tachograaf","taxi_indicator","maximum_massa_samenstelling","aantal_rolstoelplaatsen","maximum_ondersteunende_snelheid","jaar_laatste_registratie_tellerstand","tellerstandoordeel","code_toelichting_tellerstandoordeel","tenaamstellen_mogelijk","vervaldatum_apk_dt","datum_tenaamstelling_dt","datum_eerste_toelating_dt","datum_eerste_tenaamstelling_in_nederland_dt","vervaldatum_tachograaf_dt","maximum_last_onder_de_vooras_sen_tezamen_koppeling","type_remsysteem_voertuig_code","rupsonderstelconfiguratiecode","wielbasis_voertuig_minimum","wielbasis_voertuig_maximum","lengte_voertuig_minimum","lengte_voertuig_maximum","breedte_voertuig_minimum","breedte_voertuig_maximum","hoogte_voertuig","hoogte_voertuig_minimum","hoogte_voertuig_maximum","massa_bedrijfsklaar_minimaal","massa_bedrijfsklaar_maximaal","technisch_toelaatbaar_massa_koppelpunt","maximum_massa_technisch_maximaal","maximum_massa_technisch_minimaal","subcategorie_nederland","verticale_belasting_koppelpunt_getrokken_voertuig","zuinigheidsclassificatie","registratie_datum_goedkeuring_afschrijvingsmoment_bpm","registratie_datum_goedkeuring_afschrijvingsmoment_bpm_dt","gem_lading_wrde","aerodyn_voorz","massa_alt_aandr","verl_cab_ind","api_gekentekende_voertuigen_assen","api_gekentekende_voertuigen_brandstof","api_gekentekende_voertuigen_carrosserie","api_gekentekende_voertuigen_carrosserie_specifiek","api_gekentekende_voertuigen_voertuigklasse"
"G861HF","Personenauto","MASERATI","LEVANTE DIESEL","20230927",,"49255","stationwagen","5","ZWART","Niet geregistreerd","6","2987","2180","2900","2280","750","2700","20190927","20190927","Geen verstrekking in Open Data","169352","Nee","230",,,,,,"5","4","0","0",,"500","197","M1",,,,"2900","M156",,"e3*2007/46*0224*12","1G4","5HAD","0","0.09","300","Ja","Nee",,"Nee","5600","0","0.00","2023","Logisch","00","Nee","2023-09-27T00:00:00.000",,"2019-09-27T00:00:00.000","2019-09-27T00:00:00.000",,,,,,,,,,,"168",,,,,,,,,,,,,,,,,"https://opendata.rdw.nl/resource/3huj-srit.json","https://opendata.rdw.nl/resource/8ys7-d773.json","https://opendata.rdw.nl/resource/vezc-m2t6.json","https://opendata.rdw.nl/resource/jhie-znh9.json","https://opendata.rdw.nl/resource/kmfi-hrps.json"
"J082TL","Personenauto","MASERATI","LEVANTE DIESEL","20230805",,"34188","stationwagen","5","ZWART","Niet geregistreerd","6","2987","2180","2900","2280","750","2700","20170127","20201014","Geen verstrekking in Open Data","121985","Nee","230",,,,,,"4","4","0","0",,"500","197","M1",,,,"2900","M156",,"e3*2007/46*0224*08","1G4","5HW","0","0.09","300","Ja","Nee",,"Nee","5600","0","0.00","2023","Geen oordeel","05","Nee","2023-08-05T00:00:00.000",,"2017-01-27T00:00:00.000","2020-10-14T00:00:00.000",,,,,,,,,,,"168",,,,,,,,,,"E",,,,,,,"https://opendata.rdw.nl/resource/3huj-srit.json","https://opendata.rdw.nl/resource/8ys7-d773.json","https://opendata.rdw.nl/resource/vezc-m2t6.json","https://opendata.rdw.nl/resource/jhie-znh9.json","https://opendata.rdw.nl/resource/kmfi-hrps.json"
"K221VX","Personenauto","MASERATI","LEVANTE S","20250228","20230316","31388","stationwagen","5","ZWART","Niet geregistreerd","6","2979","2084","2780","2184","750","2700","20180104","20210325","Geen verstrekking in Open Data","154256","Ja","264",,,,,,"4","4","0","0",,"500","197","M1",,,"r. bodemplaat by voorzitting","2780","M156",,"e3*2007/46*0224*10","1E4","5W","0","0.14","300","Ja","Nee",,"Nee","5480","0","0.00","2024","Geen oordeel","05","Nee","2025-02-28T00:00:00.000","2023-03-16T00:00:00.000","2018-01-04T00:00:00.000","2021-03-25T00:00:00.000",,,,,,,,,,,"168",,,,,,,,,,"G",,,,,,,"https://opendata.rdw.nl/resource/3huj-srit.json","https://opendata.rdw.nl/resource/8ys7-d773.json","https://opendata.rdw.nl/resource/vezc-m2t6.json","https://opendata.rdw.nl/resource/jhie-znh9.json","https://opendata.rdw.nl/resource/kmfi-hrps.json"
"K524ZB","Personenauto","MASERATI","LEVANTE S",,,"65438","stationwagen","5","ZWART","Niet geregistreerd","6","2979","2084","2780","2184","750","2700","20210329","20210329","Geen verstrekking in Open Data","204859","Nee","264",,,,,,"5","4",,,,"500","197","M1",,,,"2780","M156",,"e3*2007/46*0224*19","1E4","5AP","0","0.14","300","Ja","Nee",,"Nee","5480",,,"2023","Logisch","00","Nee",,,"2021-03-29T00:00:00.000","2021-03-29T00:00:00.000",,,,,,,,,,,"168",,,,,,,,,,"G",,,,,,,"https://opendata.rdw.nl/resource/3huj-srit.json","https://opendata.rdw.nl/resource/8ys7-d773.json","https://opendata.rdw.nl/resource/vezc-m2t6.json","https://opendata.rdw.nl/resource/jhie-znh9.json","https://opendata.rdw.nl/resource/kmfi-hrps.json"
"KL800T","Personenauto","MASERATI","LEVANTE DIESEL","20230106",,"30843","stationwagen","5","GRIJS","Niet geregistreerd","6","2987","2180","2900","2280","750","2700","20161014","20161014","Geen verstrekking in Open Data","120561","Nee",,,,,,,"5","4","0","0",,"500","0","M1",,,"in bodemplaat r. v.","2900","M156",,"e3*2007/46*0224*08","1G4","5HW","0","0.09","300","Ja","Ja",,"Nee","5600","0","0.00","2022","Logisch","00","Nee","2023-01-06T00:00:00.000",,"2016-10-14T00:00:00.000","2016-10-14T00:00:00.000",,,,,,,,,,,,,,,,,,,,,"E",,,,,,,"https://opendata.rdw.nl/resource/3huj-srit.json","https://opendata.rdw.nl/resource/8ys7-d773.json","https://opendata.rdw.nl/resource/vezc-m2t6.json","https://opendata.rdw.nl/resource/jhie-znh9.json","https://opendata.rdw.nl/resource/kmfi-hrps.json"
"L326FF","Personenauto","MASERATI","LEVANTE DIESEL","20240827",,"26556","stationwagen","5","BLAUW","Niet geregistreerd","6","2987","2180","2900","2280","750","2700","20190827","20210429","Geen verstrekking in Open Data","126680","Nee","230",,,,,,"4","4","0","0",,"500","197","M1",,,"r. bodemplaat by voorzitting","2900","M156",,"e3*2007/46*0224*10","1G4","5HWS","0","0.09","300","Ja","Nee",,"Nee","5600","0","0.00","2023","Geen oordeel","05","Nee","2024-08-27T00:00:00.000",,"2019-08-27T00:00:00.000","2021-04-29T00:00:00.000",,,,,,,,,,,"168",,,,,,,,,,,,,,,,,"https://opendata.rdw.nl/resource/3huj-srit.json","https://opendata.rdw.nl/resource/8ys7-d773.json","https://opendata.rdw.nl/resource/vezc-m2t6.json","https://opendata.rdw.nl/resource/jhie-znh9.json","https://opendata.rdw.nl/resource/kmfi-hrps.json"
"NB904F","Personenauto","MASERATI","LEVANTE DIESEL","20240303",,"34190","stationwagen","5","BLAUW","Niet geregistreerd","6","2987","2180","2900","2280","750","2700","20170529","20170529","Geen verstrekking in Open Data","124814","Nee",,,,,,,"5","4","0","0",,"500","197","M1",,,"in bodemplaat r. v.","2900","M156",,"e3*2007/46*0224*08","1G4","5HW","0","0.09","300","Ja","Ja",,"Nee","5600","0","0.00","2023","Logisch","00","Nee","2024-03-03T00:00:00.000",,"2017-05-29T00:00:00.000","2017-05-29T00:00:00.000",,,,,,,,,,,"168",,,,,,,,,,"E",,,,,,,"https://opendata.rdw.nl/resource/3huj-srit.json","https://opendata.rdw.nl/resource/8ys7-d773.json","https://opendata.rdw.nl/resource/vezc-m2t6.json","https://opendata.rdw.nl/resource/jhie-znh9.json","https://opendata.rdw.nl/resource/kmfi-hrps.json"
"NP169P","Personenauto","MASERATI","LEVANTE DIESEL","20240325","20240206","34190","stationwagen","5","BLAUW","Niet geregistreerd","6","2987","2180","2900","2280","750","2700","20170325","20170325","Geen verstrekking in Open Data","125795","Nee",,,,,,,"5","4","0","0",,"500","197","M1",,,"in bodemplaat r. v.","2900","M156",,"e3*2007/46*0224*08","1G4","5HW","0","0.09","300","Ja","Nee",,"Nee","5600","0","0.00","2024","Logisch","00","Nee","2024-03-25T00:00:00.000","2024-02-06T00:00:00.000","2017-03-25T00:00:00.000","2017-03-25T00:00:00.000",,,,,,,,,,,"168",,,,,,,,,,"E",,,,,,,"https://opendata.rdw.nl/resource/3huj-srit.json","https://opendata.rdw.nl/resource/8ys7-d773.json","https://opendata.rdw.nl/resource/vezc-m2t6.json","https://opendata.rdw.nl/resource/jhie-znh9.json","https://opendata.rdw.nl/resource/kmfi-hrps.json"
"NT553X","Personenauto","MASERATI","LEVANTE DIESEL","20240620","20240322","34190","stationwagen","5","GRIJS","Niet geregistreerd","6","2987","2180","2900","2280","750","2700","20170421","20170421","Geen verstrekking in Open Data","133405","Ja",,,,,,,"5","4","0","0",,"500","197","M1",,,"in bodemplaat r. v.","2900","M156",,"e3*2007/46*0224*08","1G4","5HW","0","0.09","300","Ja","Nee",,"Nee","5600","0","0.00","2024","Logisch","00","Nee","2024-06-20T00:00:00.000","2024-03-22T00:00:00.000","2017-04-21T00:00:00.000","2017-04-21T00:00:00.000",,,,,,,,,,,"168",,,,,,,,,,"E",,,,,,,"https://opendata.rdw.nl/resource/3huj-srit.json","https://opendata.rdw.nl/resource/8ys7-d773.json","https://opendata.rdw.nl/resource/vezc-m2t6.json","https://opendata.rdw.nl/resource/jhie-znh9.json","https://opendata.rdw.nl/resource/kmfi-hrps.json"
"NT675J","Personenauto","MASERATI","LEVANTE DIESEL","20240418","20240219","34190","stationwagen","5","BLAUW","Niet geregistreerd","6","2987","2180","2900","2280","750","2700","20170418","20170418","Geen verstrekking in Open Data","130585","Nee",,,,,,,"5","4","0","0",,"500","197","M1",,,"in bodemplaat r. v.","2900","M156",,"e3*2007/46*0224*08","1G4","5HW","0","0.09","300","Ja","Nee",,"Nee","5600","0","0.00","2024","Logisch","00","Nee","2024-04-18T00:00:00.000","2024-02-19T00:00:00.000","2017-04-18T00:00:00.000","2017-04-18T00:00:00.000",,,,,,,,,,,"168",,,,,,,,,,"E",,,,,,,"https://opendata.rdw.nl/resource/3huj-srit.json","https://opendata.rdw.nl/resource/8ys7-d773.json","https://opendata.rdw.nl/resource/vezc-m2t6.json","https://opendata.rdw.nl/resource/jhie-znh9.json","https://opendata.rdw.nl/resource/kmfi-hrps.json"
"NT744T","Personenauto","MASERATI","LEVANTE DIESEL","20240420",,"34190","stationwagen","5","ZWART","Niet geregistreerd","6","2987","2180","2900","2280","750","2700","20170420","20170420","Geen verstrekking in Open Data","133935","Nee",,,,,,,"5","4","0","0",,"500","197","M1",,,"in bodemplaat r. v.","2900","M156",,"e3*2007/46*0224*08","1G4","5HW","0","0.09","300","Ja","Nee",,"Nee","5600","0","0.00","2023","Logisch","00","Nee","2024-04-20T00:00:00.000",,"2017-04-20T00:00:00.000","2017-04-20T00:00:00.000",,,,,,,,,,,"168",,,,,,,,,,"E",,,,,,,"https://opendata.rdw.nl/resource/3huj-srit.json","https://opendata.rdw.nl/resource/8ys7-d773.json","https://opendata.rdw.nl/resource/vezc-m2t6.json","https://opendata.rdw.nl/resource/jhie-znh9.json","https://opendata.rdw.nl/resource/kmfi-hrps.json"
"P742NS","Personenauto","MASERATI","LEVANTE TROFEO",,,"55465","stationwagen","5","ZWART","Niet geregistreerd","4","3798","2145","2825","2245",,,"20200207","20220507","Geen verstrekking in Open Data","246527","Nee","299",,,,,,"5","4","0","0",,"502","198","M1",,,,"2825","M156",,"e3*2007/46*0224*18","1H4","5HAP","0","0.19","300","Ja","Nee",,"Nee","0","0","0.00","2023","Geen oordeel","05","Nee",,,"2020-02-07T00:00:00.000","2022-05-07T00:00:00.000",,,,,,,,,,,"170",,,,,,,,,,,"20220405","2022-04-05T00:00:00.000",,,,,"https://opendata.rdw.nl/resource/3huj-srit.json","https://opendata.rdw.nl/resource/8ys7-d773.json","https://opendata.rdw.nl/resource/vezc-m2t6.json","https://opendata.rdw.nl/resource/jhie-znh9.json","https://opendata.rdw.nl/resource/kmfi-hrps.json"
"RF844P","Personenauto","MASERATI","LEVANTE DIESEL","20231212",,"34190","stationwagen","5","GROEN","Niet geregistreerd","6","2987","2180","2900","2280","750","2700","20171103","20171103","Geen verstrekking in Open Data","136597","Nee",,,,,,,"5","4","0","0",,"500","197","M1",,,"in bodemplaat r. v.","2900","M156",,"e3*2007/46*0224*10","1G4","5HWS","0","0.09","300","Ja","Nee",,"Nee","5600","0","0.00","2023","Logisch","00","Nee","2023-12-12T00:00:00.000",,"2017-11-03T00:00:00.000","2017-11-03T00:00:00.000",,,,,,,,,,,"168",,,,,,,,,,"E",,,,,,,"https://opendata.rdw.nl/resource/3huj-srit.json","https://opendata.rdw.nl/resource/8ys7-d773.json","https://opendata.rdw.nl/resource/vezc-m2t6.json","https://opendata.rdw.nl/resource/jhie-znh9.json","https://opendata.rdw.nl/resource/kmfi-hrps.json"
"RK628X","Personenauto","MASERATI","LEVANTE S","20260212","20240131","53840","stationwagen","5","ZWART","Niet geregistreerd","6","2979","2084","2780","2184","750","2700","20180102","20180102","Geen verstrekking in Open Data","169092","Ja",,,,,,,"5","4","0","0",,"500","197","M1",,,"in bodemplaat r. v.","2780","M156",,"e3*2007/46*0224*07","1E4","5W","0","0.14","300","Ja","Nee",,"Nee","5480","0","0.00","2024","Logisch","00","Nee","2026-02-12T00:00:00.000","2024-01-31T00:00:00.000","2018-01-02T00:00:00.000","2018-01-02T00:00:00.000",,,,,,,,,,,"168",,,,,,,,,,"G",,,,,,,"https://opendata.rdw.nl/resource/3huj-srit.json","https://opendata.rdw.nl/resource/8ys7-d773.json","https://opendata.rdw.nl/resource/vezc-m2t6.json","https://opendata.rdw.nl/resource/jhie-znh9.json","https://opendata.rdw.nl/resource/kmfi-hrps.json"
"RP772B","Personenauto","MASERATI","LEVANTE DIESEL","20240613",,"34190","stationwagen","5","GROEN","Niet geregistreerd","6","2987","2180","2900","2280","750","2700","20180102","20180102","Geen verstrekking in Open Data","136595","Nee",,,,,,,"5","4","0","0",,"500","197","M1",,,"in bodemplaat r. v.","2900","M156",,"e3*2007/46*0224*10","1G4","5HWS","0","0.09","300","Ja","Nee",,"Nee","5600","0","0.00","2023","Logisch","00","Nee","2024-06-13T00:00:00.000",,"2018-01-02T00:00:00.000","2018-01-02T00:00:00.000",,,,,,,,,,,"168",,,,,,,,,,"F",,,,,,,"https://opendata.rdw.nl/resource/3huj-srit.json","https://opendata.rdw.nl/resource/8ys7-d773.json","https://opendata.rdw.nl/resource/vezc-m2t6.json","https://opendata.rdw.nl/resource/jhie-znh9.json","https://opendata.rdw.nl/resource/kmfi-hrps.json"
"RS273G","Personenauto","MASERATI","LEVANTE DIESEL","20220820",,"23931","stationwagen","5","ZWART","Niet geregistreerd","6","2987","2180","2900","2280","750","2700","20170511","20180115","Geen verstrekking in Open Data","117725","Nee",,,,,,,"4","4","0","0",,"500","0","M1",,,"r. bodemplaat by voorzitting","2900","M156",,"e3*2007/46*0224*08","1G4","5HW","0","0.09","300","Ja","Nee",,"Nee","5600","0","0.00","2022","Onlogisch","04","Nee","2022-08-20T00:00:00.000",,"2017-05-11T00:00:00.000","2018-01-15T00:00:00.000",,,,,,,,,,,,,,,,,,,,,"E",,,,,,,"https://opendata.rdw.nl/resource/3huj-srit.json","https://opendata.rdw.nl/resource/8ys7-d773.json","https://opendata.rdw.nl/resource/vezc-m2t6.json","https://opendata.rdw.nl/resource/jhie-znh9.json","https://opendata.rdw.nl/resource/kmfi-hrps.json"
"RX150T","Personenauto","MASERATI","LEVANTE DIESEL","20230920",,"24736","stationwagen","5","GRIJS","Niet geregistreerd","6","2987","2180","2900","2280","750","2700","20170120","20180223","Geen verstrekking in Open Data","144634","Nee",,,,,,,"4","4","0","0",,"500","0","M1",,,"r. bodemplaat by voorzitting","2900","M156",,"e3*2007/46*0224*08","1G4","5HW","0","0.09","300","Ja","Nee",,"Nee","5600","0","0.00","2023","Geen oordeel","05","Nee","2023-09-20T00:00:00.000",,"2017-01-20T00:00:00.000","2018-02-23T00:00:00.000",,,,,,,,,,,,,,,,,,,,,"E",,,,,,,"https://opendata.rdw.nl/resource/3huj-srit.json","https://opendata.rdw.nl/resource/8ys7-d773.json","https://opendata.rdw.nl/resource/vezc-m2t6.json","https://opendata.rdw.nl/resource/jhie-znh9.json","https://opendata.rdw.nl/resource/kmfi-hrps.json"
"SH275X","Personenauto","MASERATI","LEVANTE S","20240419",,"54271","stationwagen","5","GRIJS","Niet geregistreerd","6","2979","2084","2780","2184","750","2700","20180406","20180406","Geen verstrekking in Open Data","169322","Nee",,,,,,,"5","4","0","0",,"500","197","M1",,,"in bodemplaat r. v.","2780","M156",,"e3*2007/46*0224*10","1E4","5W","0","0.14","300","Ja","Nee",,"Nee","5480","0","0.00","2023","Logisch","00","Nee","2024-04-19T00:00:00.000",,"2018-04-06T00:00:00.000","2018-04-06T00:00:00.000",,,,,,,,,,,"168",,,,,,,,,,"G",,,,,,,"https://opendata.rdw.nl/resource/3huj-srit.json","https://opendata.rdw.nl/resource/8ys7-d773.json","https://opendata.rdw.nl/resource/vezc-m2t6.json","https://opendata.rdw.nl/resource/jhie-znh9.json","https://opendata.rdw.nl/resource/kmfi-hrps.json"
"TB290Z","Personenauto","MASERATI","LEVANTE DIESEL","20230716",,"35969","stationwagen","5","BLAUW","Niet geregistreerd","6","2987","2180","2900","2280","750","2700","20180716","20180716","Geen verstrekking in Open Data","131326","Nee",,,,,,,"5","4","0","0",,"500","197","M1",,,,"2900","M156",,"e3*2007/46*0224*08","1G4","5HW","0","0.09","300","Ja","Nee",,"Nee","5600","0","0.00","2023","Logisch","00","Nee","2023-07-16T00:00:00.000",,"2018-07-16T00:00:00.000","2018-07-16T00:00:00.000",,,,,,,,,,,"168",,,,,,,,,,"F",,,,,,,"https://opendata.rdw.nl/resource/3huj-srit.json","https://opendata.rdw.nl/resource/8ys7-d773.json","https://opendata.rdw.nl/resource/vezc-m2t6.json","https://opendata.rdw.nl/resource/jhie-znh9.json","https://opendata.rdw.nl/resource/kmfi-hrps.json"
"TB722G","Personenauto","MASERATI","LEVANTE DIESEL","20240420",,"35969","stationwagen","5","ZWART","Niet geregistreerd","6","2987","2180","2900","2280","750","2700","20180627","20180627","Geen verstrekking in Open Data","144308","Nee",,,,,,,"5","4","0","0",,"500","197","M1",,,,"2900","M156",,"e3*2007/46*0224*10","1G4","5HWS","0","0.09","300","Ja","Nee",,"Nee","5600","0","0.00","2023","Logisch","00","Nee","2024-04-20T00:00:00.000",,"2018-06-27T00:00:00.000","2018-06-27T00:00:00.000",,,,,,,,,,,"168",,,,,,,,,,"F",,,,,,,"https://opendata.rdw.nl/resource/3huj-srit.json","https://opendata.rdw.nl/resource/8ys7-d773.json","https://opendata.rdw.nl/resource/vezc-m2t6.json","https://opendata.rdw.nl/resource/jhie-znh9.json","https://opendata.rdw.nl/resource/kmfi-hrps.json"
"TS609N","Personenauto","MASERATI","LEVANTE DIESEL","20240907",,"52876","stationwagen","5","GRIJS","Niet geregistreerd","6","2987","2180","2900","2280","750","2700","20181013","20181013","Geen verstrekking in Open Data","160528","Nee",,,,,,,"5","4","0","0",,"500","197","M1",,,,"2900","M156",,"e3*2007/46*0224*12","1G4","5HAD","0","0.09","300","Ja","Nee",,"Nee","5600","0","0.00","2023","Logisch","00","Nee","2024-09-07T00:00:00.000",,"2018-10-13T00:00:00.000","2018-10-13T00:00:00.000",,,,,,,,,,,"168",,,,,,,,,,,,,,,,,"https://opendata.rdw.nl/resource/3huj-srit.json","https://opendata.rdw.nl/resource/8ys7-d773.json","https://opendata.rdw.nl/resource/vezc-m2t6.json","https://opendata.rdw.nl/resource/jhie-znh9.json","https://opendata.rdw.nl/resource/kmfi-hrps.json"
"XJ311V","Personenauto","MASERATI","LEVANTE DIESEL","20230725",,"21323","stationwagen","5","BLAUW","Niet geregistreerd","6","2987","2180","2900","2280","750","2700","20170725","20190227","Geen verstrekking in Open Data","116673","Nee",,,,,,,"4","4","0","0",,"500","0","M1",,,"r. bodemplaat by voorzitting","2900","M156",,"e3*2007/46*0224*08","1G4","5HW","0","0.09","300","Ja","Nee",,"Nee","5600","0","0.00","2022","Geen oordeel","05","Nee","2023-07-25T00:00:00.000",,"2017-07-25T00:00:00.000","2019-02-27T00:00:00.000",,,,,,,,,,,,,,,,,,,,,"E",,,,,,,"https://opendata.rdw.nl/resource/3huj-srit.json","https://opendata.rdw.nl/resource/8ys7-d773.json","https://opendata.rdw.nl/resource/vezc-m2t6.json","https://opendata.rdw.nl/resource/jhie-znh9.json","https://opendata.rdw.nl/resource/kmfi-hrps.json"
"XL035N","Personenauto","MASERATI","LEVANTE S","20250508",,"52974","stationwagen","5","GRIJS","Niet geregistreerd","6","2979","2084","2780","2184","750","2700","20190131","20190131","Geen verstrekking in Open Data","174740","Nee",,,,,,,"5","4","0","0",,"500","197","M1",,,,"2780","M156",,"e3*2007/46*0224*10","1E4","5W","0","0.14","300","Ja","Nee",,"Nee","5480","0","0.00","2023","Logisch","00","Nee","2025-05-08T00:00:00.000",,"2019-01-31T00:00:00.000","2019-01-31T00:00:00.000",,,,,,,,,,,"168",,,,,,,,,,"G",,,,,,,"https://opendata.rdw.nl/resource/3huj-srit.json","https://opendata.rdw.nl/resource/8ys7-d773.json","https://opendata.rdw.nl/resource/vezc-m2t6.json","https://opendata.rdw.nl/resource/jhie-znh9.json","https://opendata.rdw.nl/resource/kmfi-hrps.json"
"ZD437H","Personenauto","MASERATI","LEVANTE DIESEL","20240322",,"30666","stationwagen","5","ZWART","Niet geregistreerd","6","2987","2180","2900","2280","750","2700","20180207","20190425","Geen verstrekking in Open Data","143861","Nee",,,,,,,"4","4","0","0",,"500","0","M1",,,,"2900","M156",,"e3*2007/46*0224*10","1G4","5HW","2","0.09","300","Ja","Nee",,"Nee","5600","0","0.00","2023","Geen oordeel","05","Nee","2024-03-22T00:00:00.000",,"2018-02-07T00:00:00.000","2019-04-25T00:00:00.000",,,,,,,,,,,,,,,,,,,,,"F",,,,,,,"https://opendata.rdw.nl/resource/3huj-srit.json","https://opendata.rdw.nl/resource/8ys7-d773.json","https://opendata.rdw.nl/resource/vezc-m2t6.json","https://opendata.rdw.nl/resource/jhie-znh9.json","https://opendata.rdw.nl/resource/kmfi-hrps.json"
