"kenteken","voertuigsoort","merk","handelsbenaming","vervaldatum_apk","datum_tenaamstelling","bruto_bpm","inrichting","aantal_zitplaatsen","eerste_kleur","tweede_kleur","aantal_cilinders","cilinderinhoud","massa_ledig_voertuig","toegestane_maximum_massa_voertuig","massa_rijklaar","maximum_massa_trekken_ongeremd","maximum_trekken_massa_geremd","datum_eerste_toelating","datum_eerste_tenaamstelling_in_nederland","wacht_op_keuren","catalogusprijs","wam_verzekerd","maximale_constructiesnelheid","laadvermogen","oplegger_geremd","aanhangwagen_autonoom_geremd","aanhangwagen_middenas_geremd","aantal_staanplaatsen","aantal_deuren","aantal_wielen","afstand_hart_koppeling_tot_achterzijde_voertuig","afstand_voorzijde_voertuig_tot_hart_koppeling","afwijkende_maximum_snelheid","lengte","breedte","europese_voertuigcategorie","europese_voertuigcategorie_toevoeging","europese_uitvoeringcategorie_toevoeging","plaats_chassisnummer","technische_max_massa_voertuig","type","type_gasinstallatie","typegoedkeuringsnummer","variant","uitvoering","volgnummer_wijziging_eu_typegoedkeuring","vermogen_massarijklaar","wielbasis","export_indicator","openstaande_terugroepactie_indicator","vervaldatum_tachograaf","taxi_indicator","maximum_massa_samenstelling","aantal_rolstoelplaatsen","maximum_ondersteunende_snelheid","jaar_laatste_registratie_tellerstand","tellerstandoordeel","code_toelichting_tellerstandoordeel","tenaamstellen_mogelijk","vervaldatum_apk_dt","datum_tenaamstelling_dt","datum_eerste_toelating_dt","datum_eerste_tenaamstelling_in_nederland_dt","vervaldatum_tachograaf_dt","maximum_last_onder_de_vooras_sen_tezamen_koppeling","type_remsysteem_voertuig_code","rupsonderstelconfiguratiecode","wielbasis_voertuig_minimum","wielbasis_voertuig_maximum","lengte_voertuig_minimum","lengte_voertuig_maximum","breedte_voertuig_minimum","breedte_voertuig_maximum","hoogte_voertuig","hoogte_voertuig_minimum","hoogte_voertuig_maximum","massa_bedrijfsklaar_minimaal","massa_bedrijfsklaar_maximaal","technisch_toelaatbaar_massa_koppelpunt","maximum_massa_technisch_maximaal","maximum_massa_technisch_minimaal","subcategorie_nederland","verticale_belasting_koppelpunt_getrokken_voertuig","zuinigheidsclassificatie","registratie_datum_goedkeuring_afschrijvingsmoment_bpm","registratie_datum_goedkeuring_afschrijvingsmoment_bpm_dt","gem_lading_wrde","aerodyn_voorz","massa_alt_aandr","verl_cab_ind","api_gekentekende_voertuigen_assen","api_gekentekende_voertuigen_brandstof","api_gekentekende_voertuigen_carrosserie","api_gekentekende_voertuigen_carrosserie_specifiek","api_gekentekende_voertuigen_voertuigklasse"
"03XKS8","Personenauto","LEXUS","LEXUS GS450H","20240429","20240216","8361","sedan","5","GRIJS","Niet geregistreerd","6","3456","1800","2325","1900","750","1500","20120628","20120628","Geen verstrekking in Open Data","73602","Ja",,,,,,,"4","4","0","0",,"485","0","M1",,,"r. schutbord","2325","HL10(A)",,"e6*2007/46*0035*00","GWL10(EA)","GWL10L-BEXQBW(1A)","0","0.03","286","Ja","Nee",,"Nee","3825","0","0.00","2024","Logisch","00","Nee","2024-04-29T00:00:00.000","2024-02-16T00:00:00.000","2012-06-28T00:00:00.000","2012-06-28T00:00:00.000",,"0",,,,,,,,,,,,,,,,,,,"A",,,,,,,"https://opendata.rdw.nl/resource/3huj-srit.json","https://opendata.rdw.nl/resource/8ys7-d773.json","https://opendata.rdw.nl/resource/vezc-m2t6.json","https://opendata.rdw.nl/resource/jhie-znh9.json","https://opendata.rdw.nl/resource/kmfi-hrps.json"
"03ZPDN","Personenauto","LEXUS","LEXUS GS450H","20240301","20240401","21344","sedan","5","GROEN","Niet geregistreerd","6","3456","1840","2355","1940","750","2000","20080411","20080411","Geen verstrekking in Open Data","85449","Ja",,,,,,,"4","4","0","0",,"0","0","M1",,,"midden tegen schutbord onder motorkap","2355",,,"e6*2001/116*0106*02","GWS191(E)","GWS191L-BEXQHW(1C)","1","0.00","285","Ja","Nee",,"Nee","4355","0","0.00","2024","Logisch","00","Nee","2024-03-01T00:00:00.000","2024-04-01T00:00:00.000","2008-04-11T00:00:00.000","2008-04-11T00:00:00.000",,,,,,,,,,,,,,,,,,,,,"C",,,,,,,"https://opendata.rdw.nl/resource/3huj-srit.json","https://opendata.rdw.nl/resource/8ys7-d773.json","https://opendata.rdw.nl/resource/vezc-m2t6.json","https://opendata.rdw.nl/resource/jhie-znh9.json","https://opendata.rdw.nl/resource/kmfi-hrps.json"
"25RFB8","Personenauto","LEXUS","LEXUS GS450H","20230927",,"13783","sedan","5","ZWART","Niet geregistreerd","6","3456","1835","2355","1935","750","2000","20110506","20110506","Geen verstrekking in Open Data","78530","Nee",,,,,,,"4","4","0","0",,"485","0","M1",,,"midden tegen schutbord onder motorkap","2355","HS19(A)",,"e6*2001/116*0106*06","GWS191(E)","GWS191L-BEXQHW(1G)","0","0.00","285","Ja","Nee",,"Nee","4355","0","0.00","2022","Logisch","00","Nee","2023-09-27T00:00:00.000",,"2011-05-06T00:00:00.000","2011-05-06T00:00:00.000",,,,,,,,,,,,,,,,,,,,,"C",,,,,,,"https://opendata.rdw.nl/resource/3huj-srit.json","https://opendata.rdw.nl/resource/8ys7-d773.json","https://opendata.rdw.nl/resource/vezc-m2t6.json","https://opendata.rdw.nl/resource/jhie-znh9.json","https://opendata.rdw.nl/resource/kmfi-hrps.json"
"40XRJN","Personenauto","LEXUS","LEXUS GS450H","20230129",,"21693","sedan","5","BLAUW","Niet geregistreerd","6","3456","1840","2355","1940","750","2000","20070828","20070828","Geen verstrekking in Open Data","82860","Nee",,,,,,,"4","4","0","0",,"0","0","M1",,,"midden tegen schutbord onder motorkap","2355",,,"e6*2001/116*0106*01","GWS191(E)","GWS191L-BEXQHW(1B)","0","0.00","285","Ja","Nee",,"Nee","4355","0","0.00","2022","Logisch","00","Nee","2023-01-29T00:00:00.000",,"2007-08-28T00:00:00.000","2007-08-28T00:00:00.000",,,,,,,,,,,,,,,,,,,,,"C",,,,,,,"https://opendata.rdw.nl/resource/3huj-srit.json","https://opendata.rdw.nl/resource/8ys7-d773.json","https://opendata.rdw.nl/resource/vezc-m2t6.json","https://opendata.rdw.nl/resource/jhie-znh9.json","https://opendata.rdw.nl/resource/kmfi-hrps.json"
"55XLXF","Personenauto","LEXUS","LEXUS GS450H","20240413",,"19405","sedan","5","GROEN","Niet geregistreerd","6","3456","1840","2355","1940","750","2000","20070716","20070716","Geen verstrekking in Open Data","74549","Nee",,,,,,,"4","4","0","0",,"0","0","M1",,,"midden tegen schutbord onder motorkap","2355",,,"e6*2001/116*0106*01","GWS191(E)","GWS191L-BEXQHW(1B)","0","0.00","285","Ja","Nee",,"Nee","4355","0","0.00","2023","Onlogisch","04","Nee","2024-04-13T00:00:00.000",,"2007-07-16T00:00:00.000","2007-07-16T00:00:00.000",,,,,,,,,,,,,,,,,,,,,"C",,,,,,,"https://opendata.rdw.nl/resource/3huj-srit.json","https://opendata.rdw.nl/resource/8ys7-d773.json","https://opendata.rdw.nl/resource/vezc-m2t6.json","https://opendata.rdw.nl/resource/jhie-znh9.json","https://opendata.rdw.nl/resource/kmfi-hrps.json"
"60ZHL4","Personenauto","LEXUS","LEXUS GS450H","20241215",,"9780","sedan","5","GROEN","Niet geregistreerd","6","3456","1835","2355","1935","750","2000","20081023","20121114","Geen verstrekking in Open Data","77150","Nee",,,,,,,"4","4","0","0",,"485","0","M1",,,"r. schutbord","2355","HS19(A)",,"e6*2001/116*0106*03","GWS191(E)","GWS191L-BEXQHW(1D)","0","0.00","285","Ja","Nee",,"Nee","4355","0","0.00","2023","Geen oordeel","05","Nee","2024-12-15T00:00:00.000",,"2008-10-23T00:00:00.000","2012-11-14T00:00:00.000",,"0",,,,,,,,,,,,,,,,,,,"B",,,,,,,"https://opendata.rdw.nl/resource/3huj-srit.json","https://opendata.rdw.nl/resource/8ys7-d773.json","https://opendata.rdw.nl/resource/vezc-m2t6.json","https://opendata.rdw.nl/resource/jhie-znh9.json","https://opendata.rdw.nl/resource/kmfi-hrps.json"
"65HLX7","Personenauto","LEXUS","LEXUS GS450H","20241120",,"17259","sedan","5","GRIJS","Niet geregistreerd","6","3456","1835","2355","1935","750","2000","20090109","20090109","Geen verstrekking in Open Data","81956","Nee",,,,,,,"4","4","0","0",,"485","0","M1",,,"midden tegen schutbord onder motorkap","2355","HS19(A)",,"e6*2001/116*0106*04","GWS191(E)","GWS191L-BEXQHW(1E)","0","0.00","285","Ja","Nee",,"Nee","4355","0","0.00","2023","Logisch","00","Nee","2024-11-20T00:00:00.000",,"2009-01-09T00:00:00.000","2009-01-09T00:00:00.000",,,,,,,,,,,,,,,,,,,,,"B",,,,,,,"https://opendata.rdw.nl/resource/3huj-srit.json","https://opendata.rdw.nl/resource/8ys7-d773.json","https://opendata.rdw.nl/resource/vezc-m2t6.json","https://opendata.rdw.nl/resource/jhie-znh9.json","https://opendata.rdw.nl/resource/kmfi-hrps.json"
"95TGBK","Personenauto","LEXUS","LEXUS GS450H","20250215","20240301","19860","sedan","5","GRIJS","Niet geregistreerd","6","3456","1840","2355","1940","750","2000","20060819","20060819","Geen verstrekking in Open Data","84100","Ja",,,,,,,"4","4","0","0",,"0","0","M1",,,"midden tegen schutbord onder motorkap","2355",,,"e6*2001/116*0106*00","GWS191(E)","GWS191L-BEXQHW(1A)","0","0.00","285","Ja","Nee",,"Nee","4355","0","0.00","2024","Logisch","00","Nee","2025-02-15T00:00:00.000","2024-03-01T00:00:00.000","2006-08-19T00:00:00.000","2006-08-19T00:00:00.000",,,,,,,,,,,,,,,,,,,,,"B",,,,,,,"https://opendata.rdw.nl/resource/3huj-srit.json","https://opendata.rdw.nl/resource/8ys7-d773.json","https://opendata.rdw.nl/resource/vezc-m2t6.json","https://opendata.rdw.nl/resource/jhie-znh9.json","https://opendata.rdw.nl/resource/kmfi-hrps.json"
"HF484L","Personenauto","LEXUS","LEXUS GS450H","20240327","20151016","6207","sedan","5","ZWART","Niet geregistreerd","6","3456","1820","2325","1920","750","1500","20120529","20151016","Geen verstrekking in Open Data","81530","Nee",,,,,,,"4","4","0","0",,"485","0","M1",,,"r. schutbord","2325","HL10(A)",,"e6*2007/46*0035*00","GWL10(EB)","GWL10L-BEXQBW(4A)","0","0.03","286","Ja","Nee",,"Nee","3825","0","0.00","2024","Geen oordeel","05","Nee","2024-03-27T00:00:00.000","2015-10-16T00:00:00.000","2012-05-29T00:00:00.000","2015-10-16T00:00:00.000",,,,,,,,,,,,,,,,,,,,,"A",,,,,,,"https://opendata.rdw.nl/resource/3huj-srit.json","https://opendata.rdw.nl/resource/8ys7-d773.json","https://opendata.rdw.nl/resource/vezc-m2t6.json","https://opendata.rdw.nl/resource/jhie-znh9.json","https://opendata.rdw.nl/resource/kmfi-hrps.json"
"HX750G","Personenauto","LEXUS","LEXUS GS450H","20240210",,"6519","sedan","5","BLAUW","Niet geregistreerd","6","3456","1800","2335","1900","750","1500","20160210","20160210","Geen verstrekking in Open Data","85566","Nee",,,,,,,"4","4","0","0",,"488","0","M1",,,"in motorruimte a.","2335","HS19(A)",,"e6*2001/116*0106*11","GWL10(EA)","GWL10L-BEXQBW(5M)","0","0.11","286","Ja","Ja",,"Nee","3835","0","0.00","2022","Logisch","00","Nee","2024-02-10T00:00:00.000",,"2016-02-10T00:00:00.000","2016-02-10T00:00:00.000",,,,,,,,,,,,,,,,,,,,,"C",,,,,,,"https://opendata.rdw.nl/resource/3huj-srit.json","https://opendata.rdw.nl/resource/8ys7-d773.json","https://opendata.rdw.nl/resource/vezc-m2t6.json","https://opendata.rdw.nl/resource/jhie-znh9.json","https://opendata.rdw.nl/resource/kmfi-hrps.json"
"HZ513R","Personenauto","LEXUS","LEXUS GS450H","20240417",,"6356","sedan","5","GRIJS","Niet geregistreerd","6","3456","1795","2305","1895","750","1500","20160121","20160121","Geen verstrekking in Open Data","65695","Nee",,,,,,,"4","4","0","0",,"488","0","M1",,,"in motorruimte a.","2305","HS19(A)",,"e6*2001/116*0106*11","GWL10(EA)","GWL10L-BEXEBW(1M)","0","0.11","286","Ja","Ja",,"Nee","3805","0","0.00","2022","Logisch","00","Nee","2024-04-17T00:00:00.000",,"2016-01-21T00:00:00.000","2016-01-21T00:00:00.000",,,,,,,,,,,,,,,,,,,,,"B",,,,,,,"https://opendata.rdw.nl/resource/3huj-srit.json","https://opendata.rdw.nl/resource/8ys7-d773.json","https://opendata.rdw.nl/resource/vezc-m2t6.json","https://opendata.rdw.nl/resource/jhie-znh9.json","https://opendata.rdw.nl/resource/kmfi-hrps.json"
"KN267F","Personenauto","LEXUS","LEXUS GS450H","20230726",,"5507","sedan","5","ZWART","Niet geregistreerd","6","3456","1800","2325","1900","750","1500","20130703","20161013","Geen verstrekking in Open Data","83331","Nee",,,,,,,"4","4","0","0",,"485","0","M1",,,"midden tegen schutbord onder motorkap","2325","HS19(A)",,"e6*2001/116*0106*08","GWL10(EB)","GWL10L-BEXQBW(4J)","0","0.00","286","Ja","Ja",,"Nee","3825","0","0.00","2022","Geen oordeel","05","Nee","2023-07-26T00:00:00.000",,"2013-07-03T00:00:00.000","2016-10-13T00:00:00.000",,,,,,,,,,,,,,,,,,,,,"A",,,,,,,"https://opendata.rdw.nl/resource/3huj-srit.json","https://opendata.rdw.nl/resource/8ys7-d773.json","https://opendata.rdw.nl/resource/vezc-m2t6.json","https://opendata.rdw.nl/resource/jhie-znh9.json","https://opendata.rdw.nl/resource/kmfi-hrps.json"
"L232HL","Personenauto","LEXUS","LEXUS GS450H","20230818",,"7345","sedan","5","ZWART","Niet geregistreerd","6","3456","1800","2335","1900","750","1500","20161219","20210525","Geen verstrekking in Open Data","86045","Nee","250",,,,,,"4","4","0","0",,"488","184","M1",,,,"2335","HS19(A)",,"e6*2001/116*0106*12","GWL10(EB)","GWL10L-BEXQBW(4N)","2","0.03","286","Ja","Ja",,"Nee","3835","0","0.00","2021","Geen oordeel","05","Nee","2023-08-18T00:00:00.000",,"2016-12-19T00:00:00.000","2021-05-25T00:00:00.000",,,,,,,,,,,"146",,,,,,,,,,,,,,,,,"https://opendata.rdw.nl/resource/3huj-srit.json","https://opendata.rdw.nl/resource/8ys7-d773.json","https://opendata.rdw.nl/resource/vezc-m2t6.json","https://opendata.rdw.nl/resource/jhie-znh9.json","https://opendata.rdw.nl/resource/kmfi-hrps.json"
"L653PX","Personenauto","LEXUS","LEXUS GS450H","20240708",,"11799","sedan","5","GRIJS","Niet geregistreerd","6","3456","1840","2355","1940","750","2000","20080229","20210705","Geen verstrekking in Open Data",,"Nee","250",,,,,,"4","4","0","0",,"0","182","M1",,,,"2355",,,"e6*2001/116*0106*02","GWS191(E)","GWS191L-BEXQHW(1C)","1","0.00","285","Ja","Nee",,"Nee","4355","0","0.00","2023","Geen oordeel","05","Nee","2024-07-08T00:00:00.000",,"2008-02-29T00:00:00.000","2021-07-05T00:00:00.000",,,,,,,,,,,"143",,,,,,,,,,,,,,,,,"https://opendata.rdw.nl/resource/3huj-srit.json","https://opendata.rdw.nl/resource/8ys7-d773.json","https://opendata.rdw.nl/resource/vezc-m2t6.json","https://opendata.rdw.nl/resource/jhie-znh9.json","https://opendata.rdw.nl/resource/kmfi-hrps.json"
"N381DT","Personenauto","LEXUS","LEXUS GS450H","20230924",,"1560","sedan","5","GRIJS","Niet geregistreerd","6","3456","1800","2325","1900","750","1500","20131106","20220722","Geen verstrekking in Open Data","88110","Nee","250",,,,,,"4","4","0","0",,"485","184","M1",,,"midden tegen schutbord onder motorkap","2325","HS19(A)",,"e6*2001/116*0106*08","GWL10(EB)","GWL10L-BEXQBW(4J)","0","0.00","286","Ja","Ja",,"Nee","3825","0","0.00","2022","Geen oordeel","05","Nee","2023-09-24T00:00:00.000",,"2013-11-06T00:00:00.000","2022-07-22T00:00:00.000",,,,,,,,,,,"146",,,,,,,,,,,,,,,,,"https://opendata.rdw.nl/resource/3huj-srit.json","https://opendata.rdw.nl/resource/8ys7-d773.json","https://opendata.rdw.nl/resource/vezc-m2t6.json","https://opendata.rdw.nl/resource/jhie-znh9.json","https://opendata.rdw.nl/resource/kmfi-hrps.json"
"P172GD","Personenauto","LEXUS","LEXUS GS450H","20230513",,"6354","sedan","5","GRIJS","Niet geregistreerd","6","3456","1870","2325","1970","750","1500","20120726","20220516","Geen verstrekking in Open Data","80050","Nee","250",,,,,,"4","4","0","0",,"485","184","M1",,,,"2325","HL10(A)",,"e6*2007/46*0035*00","GWL10(EB)","GWL10L-BEXQBW(4A)","0","0.02","286","Ja","Ja",,"Nee","3825","0","0.00","2022","Geen oordeel","05","Nee","2023-05-13T00:00:00.000",,"2012-07-26T00:00:00.000","2022-05-16T00:00:00.000",,,,,,,,,,,"146",,,,,,,,,,,"20220217","2022-02-17T00:00:00.000",,,,,"https://opendata.rdw.nl/resource/3huj-srit.json","https://opendata.rdw.nl/resource/8ys7-d773.json","https://opendata.rdw.nl/resource/vezc-m2t6.json","https://opendata.rdw.nl/resource/jhie-znh9.json","https://opendata.rdw.nl/resource/kmfi-hrps.json"
"PK039S","Personenauto","LEXUS","LEXUS GS450H","20250727",,"8456","sedan","5","WIT","Niet geregistreerd","6","3456","1800","2335","1900","750","1500","20170727","20170727","Geen verstrekking in Open Data","88295","Nee",,,,,,,"4","4","0","0",,"488","184","M1",,,"in motorruimte","2335","HS19(A)",,"e6*2001/116*0106*12","GWL10(EA)","GWL10L-BEXQBW(5N)","0","0.11","286","Ja","Nee",,"Nee","3835","0","0.00","2023","Logisch","00","Nee","2025-07-27T00:00:00.000",,"2017-07-27T00:00:00.000","2017-07-27T00:00:00.000",,,,,,,,,,,"146",,,,,,,,,,"C",,,,,,,"https://opendata.rdw.nl/resource/3huj-srit.json","https://opendata.rdw.nl/resource/8ys7-d773.json","https://opendata.rdw.nl/resource/vezc-m2t6.json","https://opendata.rdw.nl/resource/jhie-znh9.json","https://opendata.rdw.nl/resource/kmfi-hrps.json"
"PR679S","Personenauto","LEXUS","LEXUS GS450H","20230818",,"6346","sedan","5","ZWART","Niet geregistreerd","6","3456","1800","2325","1900","750","1500","20120829","20170828","Geen verstrekking in Open Data","90850","Nee",,,,,,,"4","4","0","0",,"485","0","M1",,,"r. schutbord","2325","HL10(A)",,"e6*2007/46*0035*00","GWL10(EB)","GWL10L-BEXQBW(4A)","0","0.03","286","Ja","Ja",,"Nee","3825","0","0.00","2022","Geen oordeel","05","Nee","2023-08-18T00:00:00.000",,"2012-08-29T00:00:00.000","2017-08-28T00:00:00.000",,,,,,,,,,,,,,,,,,,,,"A",,,,,,,"https://opendata.rdw.nl/resource/3huj-srit.json","https://opendata.rdw.nl/resource/8ys7-d773.json","https://opendata.rdw.nl/resource/vezc-m2t6.json","https://opendata.rdw.nl/resource/jhie-znh9.json","https://opendata.rdw.nl/resource/kmfi-hrps.json"
"RV286P","Personenauto","LEXUS","LEXUS GS450H","20240221",,"7498","sedan","5","GRIJS","Niet geregistreerd","6","3456","1795","2305","1895","750","1500","20180221","20180221","Geen verstrekking in Open Data","75295","Nee",,,,,,,"4","4","0","0",,"488","184","M1",,,"in motorruimte","2305","HS19(A)",,"e6*2001/116*0106*13","GWL10(EA)","GWL10L-BEXEBW(1P)","0","0.11","286","Ja","Ja",,"Nee","3805","0","0.00","2022","Logisch","00","Nee","2024-02-21T00:00:00.000",,"2018-02-21T00:00:00.000","2018-02-21T00:00:00.000",,,,,,,,,,,"146",,,,,,,,,,"C",,,,,,,"https://opendata.rdw.nl/resource/3huj-srit.json","https://opendata.rdw.nl/resource/8ys7-d773.json","https://opendata.rdw.nl/resource/vezc-m2t6.json","https://opendata.rdw.nl/resource/jhie-znh9.json","https://opendata.rdw.nl/resource/kmfi-hrps.json"
"SX983N","Personenauto","LEXUS","LEXUS GS450H","20230729",,"5250","sedan","5","GRIJS","Niet geregistreerd","6","3456","1800","2325","1900","750","1500","20130729","20180614","Geen verstrekking in Open Data","66175","Nee",,,,,,,"4","4",,,,,,"M1",,,"midden tegen schutbord onder motorkap","2325","HS19(A)",,,,,,"0.00","286","Ja","Nee",,"Nee","3825",,,"2023","Geen oordeel","05","Nee","2023-07-29T00:00:00.000",,"2013-07-29T00:00:00.000","2018-06-14T00:00:00.000",,,,,,,,,,,,,,,,,,,,,,,,,,,,"https://opendata.rdw.nl/resource/3huj-srit.json","https://opendata.rdw.nl/resource/8ys7-d773.json","https://opendata.rdw.nl/resource/vezc-m2t6.json","https://opendata.rdw.nl/resource/jhie-znh9.json","https://opendata.rdw.nl/resource/kmfi-hrps.json"
"T092TG","Personenauto","LEXUS","LEXUS GS450H",,,"1493","sedan","5","ZWART","Niet geregistreerd","6","3456","1870","2355","1970","750","2000","20111108","20230829","Geen verstrekking in Open Data","71189","Nee","240",,,,,,"4","4",,,,"485","182","M1",,,,"2355","HS19(A)",,,,,,"0.00","285","Ja","Nee",,"Nee","4355",,,"2023","Geen oordeel","05","Nee",,,"2011-11-08T00:00:00.000","2023-08-29T00:00:00.000",,,,,,,,,,,"143",,,,,,,,,,,"20230807","2023-08-07T00:00:00.000",,,,,"https://opendata.rdw.nl/resource/3huj-srit.json","https://opendata.rdw.nl/resource/8ys7-d773.json","https://opendata.rdw.nl/resource/vezc-m2t6.json","https://opendata.rdw.nl/resource/jhie-znh9.json","https://opendata.rdw.nl/resource/kmfi-hrps.json"
"T593GX","Personenauto","LEXUS","LEXUS GS450H",,,"11686","sedan","5","GRIJS","Niet geregistreerd","6","3456","1840","2355","1940","750","2000","20080529","20230707","Geen verstrekking in Open Data",,"Nee","250",,,,,,"4","4","0","0",,"0","182","M1",,,,"2355",,,"e6*2001/116*0106*02","GWS191(E)","GWS191L-BEXQHW(1C)","1","0.00","285","Ja","Nee",,"Nee","4355","0","0.00","2023","Geen oordeel","05","Nee",,,"2008-05-29T00:00:00.000","2023-07-07T00:00:00.000",,,,,,,,,,,"143",,,,,,,,,,,"20230611","2023-06-11T00:00:00.000",,,,,"https://opendata.rdw.nl/resource/3huj-srit.json","https://opendata.rdw.nl/resource/8ys7-d773.json","https://opendata.rdw.nl/resource/vezc-m2t6.json","https://opendata.rdw.nl/resource/jhie-znh9.json","https://opendata.rdw.nl/resource/kmfi-hrps.json"
"TN880N","Personenauto","LEXUS","LEXUS GS450H","20230816",,"6363","sedan","5","GRIJS","Niet geregistreerd","6","3456","1800","2325","1900","750","1500","20120528","20181130","Geen verstrekking in Open Data","89799","Nee",,,,,,,"4","4","0","0",,"485","0","M1",,,,"2325","HL10(A)",,"e6*2007/46*0035*00","GWL10(EB)","GWL10L-BEXQBW(4A)","0","0.03","286","Ja","Ja",,"Nee","3825","0","0.00","2022","Geen oordeel","05","Nee","2023-08-16T00:00:00.000",,"2012-05-28T00:00:00.000","2018-11-30T00:00:00.000",,,,,,,,,,,,,,,,,,,,,"A",,,,,,,"https://opendata.rdw.nl/resource/3huj-srit.json","https://opendata.rdw.nl/resource/8ys7-d773.json","https://opendata.rdw.nl/resource/vezc-m2t6.json","https://opendata.rdw.nl/resource/jhie-znh9.json","https://opendata.rdw.nl/resource/kmfi-hrps.json"
"ZV977V","Personenauto","LEXUS","LEXUS GS450H","20231116",,"4610","sedan","5","BLAUW","Niet geregistreerd","6","3456","1800","2325","1900","750","1500","20120925","20191023","Geen verstrekking in Open Data","92424","Nee","250",,,,,,"4","4","0","0",,"485","184","M1",,,"r. schutbord","2325","HL10(A)",,"e6*2007/46*0035*00","GWL10(EA)","GWL10L-BEXQBW(2A)","0","0.03","286","Ja","Ja",,"Nee","3825","0","0.00","2022","Geen oordeel","05","Nee","2023-11-16T00:00:00.000",,"2012-09-25T00:00:00.000","2019-10-23T00:00:00.000",,,,,,,,,,,"146",,,,,,,,,,"A",,,,,,,"https://opendata.rdw.nl/resource/3huj-srit.json","https://opendata.rdw.nl/resource/8ys7-d773.json","https://opendata.rdw.nl/resource/vezc-m2t6.json","https://opendata.rdw.nl/resource/jhie-znh9.json","https://opendata.rdw.nl/resource/kmfi-hrps.json"
