"kenteken","voertuigsoort","merk","handelsbenaming","vervaldatum_apk","datum_tenaamstelling","bruto_bpm","inrichting","aantal_zitplaatsen","eerste_kleur","tweede_kleur","aantal_cilinders","cilinderinhoud","massa_ledig_voertuig","toegestane_maximum_massa_voertuig","massa_rijklaar","maximum_massa_trekken_ongeremd","maximum_trekken_massa_geremd","datum_eerste_toelating","datum_eerste_tenaamstelling_in_nederland","wacht_op_keuren","catalogusprijs","wam_verzekerd","maximale_constructiesnelheid","laadvermogen","oplegger_geremd","aanhangwagen_autonoom_geremd","aanhangwagen_middenas_geremd","aantal_staanplaatsen","aantal_deuren","aantal_wielen","afstand_hart_koppeling_tot_achterzijde_voertuig","afstand_voorzijde_voertuig_tot_hart_koppeling","afwijkende_maximum_snelheid","lengte","breedte","europese_voertuigcategorie","europese_voertuigcategorie_toevoeging","europese_uitvoeringcategorie_toevoeging","plaats_chassisnummer","technische_max_massa_voertuig","type","type_gasinstallatie","typegoedkeuringsnummer","variant","uitvoering","volgnummer_wijziging_eu_typegoedkeuring","vermogen_massarijklaar","wielbasis","export_indicator","openstaande_terugroepactie_indicator","vervaldatum_tachograaf","taxi_indicator","maximum_massa_samenstelling","aantal_rolstoelplaatsen","maximum_ondersteunende_snelheid","jaar_laatste_registratie_tellerstand","tellerstandoordeel","code_toelichting_tellerstandoordeel","tenaamstellen_mogelijk","vervaldatum_apk_dt","datum_tenaamstelling_dt","datum_eerste_toelating_dt","datum_eerste_tenaamstelling_in_nederland_dt","vervaldatum_tachograaf_dt","maximum_last_onder_de_vooras_sen_tezamen_koppeling","type_remsysteem_voertuig_code","rupsonderstelconfiguratiecode","wielbasis_voertuig_minimum","wielbasis_voertuig_maximum","lengte_voertuig_minimum","lengte_voertuig_maximum","breedte_voertuig_minimum","breedte_voertuig_maximum","hoogte_voertuig","hoogte_voertuig_minimum","hoogte_voertuig_maximum","massa_bedrijfsklaar_minimaal","massa_bedrijfsklaar_maximaal","technisch_toelaatbaar_massa_koppelpunt","maximum_massa_technisch_maximaal","maximum_massa_technisch_minimaal","subcategorie_nederland","verticale_belasting_koppelpunt_getrokken_voertuig","zuinigheidsclassificatie","registratie_datum_goedkeuring_afschrijvingsmoment_bpm","registratie_datum_goedkeuring_afschrijvingsmoment_bpm_dt","gem_lading_wrde","aerodyn_voorz","massa_alt_aandr","verl_cab_ind","api_gekentekende_voertuigen_assen","api_gekentekende_voertuigen_brandstof","api_gekentekende_voertuigen_carrosserie","api_gekentekende_voertuigen_carrosserie_specifiek","api_gekentekende_voertuigen_voertuigklasse"
"1TGG64","Personenauto","JAGUAR LAND ROVER","DISCOVERY 4","20250306","20240129","27668","stationwagen","7","BRUIN","Niet geregistreerd","6","2993","2475","3240","2575","750","3500","20130531","20140123","Geen verstrekking in Open Data","119235","Ja",,,,,,,"4","4","0","0",,"0","0","M1",,,"tegen r. balk a. vooras","3240","LA",,"e11*2001/116*0233*16","S4KW2F","E7O1","0","0.07","289","Ja","Nee",,"Nee","6740","0","0.00","2024","Geen oordeel","05","Nee","2025-03-06T00:00:00.000","2024-01-29T00:00:00.000","2013-05-31T00:00:00.000","2014-01-23T00:00:00.000",,,,,,,,,,,,,,,,,,,,,"G",,,,,,,"https://opendata.rdw.nl/resource/3huj-srit.json","https://opendata.rdw.nl/resource/8ys7-d773.json","https://opendata.rdw.nl/resource/vezc-m2t6.json","https://opendata.rdw.nl/resource/jhie-znh9.json","https://opendata.rdw.nl/resource/kmfi-hrps.json"
"GP242D","Personenauto","JAGUAR LAND ROVER","DISCOVERY 4","20240515",,"29570","stationwagen","7","ZWART","Niet geregistreerd","6","2993","2475","3240","2575","750","3500","20131111","20150724","Geen verstrekking in Open Data","99988","Nee",,,,,,,"4","4","0","0",,"0","0","M1",,,"r. balk a. vooras","3240","LA",,"e11*2001/116*0233*17","S4KW2F","E7O1","0","0.07","289","Ja","Nee",,"Nee","6740","0","0.00","2023","Geen oordeel","05","Nee","2024-05-15T00:00:00.000",,"2013-11-11T00:00:00.000","2015-07-24T00:00:00.000",,,,,,,,,,,,,,,,,,,,,"G",,,,,,,"https://opendata.rdw.nl/resource/3huj-srit.json","https://opendata.rdw.nl/resource/8ys7-d773.json","https://opendata.rdw.nl/resource/vezc-m2t6.json","https://opendata.rdw.nl/resource/jhie-znh9.json","https://opendata.rdw.nl/resource/kmfi-hrps.json"
"HJ938P","Personenauto","JAGUAR LAND ROVER","DISCOVERY SPORT","20240224",,"11240","stationwagen","5","GROEN","Niet geregistreerd","4","2179","1744","2505","1844","750","2200","20150727","20151111","Geen verstrekking in Open Data","66570","Nee",,,,,,,"5","4","0","0",,"0","0","M1",,,"r. motorruimte","2505","LC",,"e11*2007/46*1659*03","S5AA2F","A5A2","0","0.06","274","Ja","Nee",,"Nee","4705","0","0.00","2023","Geen oordeel","05","Nee","2024-02-24T00:00:00.000",,"2015-07-27T00:00:00.000","2015-11-11T00:00:00.000",,,,,,,,,,,,,,,,,,,,,"E",,,,,,,"https://opendata.rdw.nl/resource/3huj-srit.json","https://opendata.rdw.nl/resource/8ys7-d773.json","https://opendata.rdw.nl/resource/vezc-m2t6.json","https://opendata.rdw.nl/resource/jhie-znh9.json","https://opendata.rdw.nl/resource/kmfi-hrps.json"
"J888GJ","Personenauto","JAGUAR LAND ROVER","DISCOVERY","20240728",,"28142","stationwagen","5","BLAUW","Niet geregistreerd","6","2993","2475","3240","2575","750","3500","20150105","20200722","Geen verstrekking in Open Data","110847","Nee","180",,,,,,"4","4","0","0",,"0","0","M1",,,,"3240","LA",,"e11*2001/116*0233*18","S4KW2F","E5O2","0","0.07","289","Ja","Nee",,"Nee","6740","0","0.00","2024","Geen oordeel","05","Nee","2024-07-28T00:00:00.000",,"2015-01-05T00:00:00.000","2020-07-22T00:00:00.000",,,,,,,,,,,,,,,,,,,,,"G",,,,,,,"https://opendata.rdw.nl/resource/3huj-srit.json","https://opendata.rdw.nl/resource/8ys7-d773.json","https://opendata.rdw.nl/resource/vezc-m2t6.json","https://opendata.rdw.nl/resource/jhie-znh9.json","https://opendata.rdw.nl/resource/kmfi-hrps.json"
"JP694D","Personenauto","JAGUAR LAND ROVER","DISCOVERY 4","20230105",,"43129","stationwagen","7","ZWART","Niet geregistreerd","6","2993","2475","3240","2575","750","3500","20140120","20140120","Geen verstrekking in Open Data","108897","Nee",,,,,,,"4","4",,,,,,"M1",,,"tegen r. balk a. vooras","3240","LA",,,,,,"0.07","289","Ja","Nee",,"Nee","6740",,,"2022","Geen oordeel","05","Nee","2023-01-05T00:00:00.000",,"2014-01-20T00:00:00.000","2014-01-20T00:00:00.000",,,,,,,,,,,,,,,,,,,,,,,,,,,,"https://opendata.rdw.nl/resource/3huj-srit.json","https://opendata.rdw.nl/resource/8ys7-d773.json","https://opendata.rdw.nl/resource/vezc-m2t6.json","https://opendata.rdw.nl/resource/jhie-znh9.json","https://opendata.rdw.nl/resource/kmfi-hrps.json"
"JX506H","Personenauto","JAGUAR LAND ROVER","DISCOVERY","20240504",,"36039","stationwagen","5","ZWART","Niet geregistreerd","6","2993","2475","3240","2575","750","3500","20150930","20160628","Geen verstrekking in Open Data","90822","Nee",,,,,,,"4","4","0","0",,"0","0","M1",,,"tegen r. balk a. vooras","3240","LA",,"e11*2001/116*0233*17","S4KQ2F","E5O2","0","0.06","289","Ja","Nee",,"Nee","6740","0","0.00","2023","Geen oordeel","05","Nee","2024-05-04T00:00:00.000",,"2015-09-30T00:00:00.000","2016-06-28T00:00:00.000",,,,,,,,,,,,,,,,,,,,,"G",,,,,,,"https://opendata.rdw.nl/resource/3huj-srit.json","https://opendata.rdw.nl/resource/8ys7-d773.json","https://opendata.rdw.nl/resource/vezc-m2t6.json","https://opendata.rdw.nl/resource/jhie-znh9.json","https://opendata.rdw.nl/resource/kmfi-hrps.json"
"KB888L","Personenauto","JAGUAR LAND ROVER","DISCOVERY SPORT","20220706",,"12963","stationwagen","5","ZWART","Niet geregistreerd","4","2179","1744","2505","1844","750","2500","20150706","20160723","Geen verstrekking in Open Data","70820","Nee",,,,,,,"5","4","0","0",,"0","0","M1",,,"r. motorruimte","2505","LC",,"e11*2007/46*1659*03","S5AB2F","A5A1","0","0.08","274","Ja","Nee",,"Nee","5005","0","0.00","2022","Geen oordeel","05","Nee","2022-07-06T00:00:00.000",,"2015-07-06T00:00:00.000","2016-07-23T00:00:00.000",,,,,,,,,,,,,,,,,,,,,"F",,,,,,,"https://opendata.rdw.nl/resource/3huj-srit.json","https://opendata.rdw.nl/resource/8ys7-d773.json","https://opendata.rdw.nl/resource/vezc-m2t6.json","https://opendata.rdw.nl/resource/jhie-znh9.json","https://opendata.rdw.nl/resource/kmfi-hrps.json"
"KH522R","Personenauto","JAGUAR LAND ROVER","DISCOVERY","20230309",,"26861","stationwagen","7","BRUIN","Niet geregistreerd","6","2993","2475","3260","2575","750","3500","20140121","20160914","Geen verstrekking in Open Data","111620","Nee",,,,,,,"4","4","0","0",,"0","0","M1",,,"tegen r. balk a. vooras","3260","LA",,"e11*2001/116*0233*17","S4KW2F","E7K1","0","0.07","289","Ja","Nee",,"Nee","6760","0","0.00","2022","Geen oordeel","05","Nee","2023-03-09T00:00:00.000",,"2014-01-21T00:00:00.000","2016-09-14T00:00:00.000",,,,,,,,,,,,,,,,,,,,,"G",,,,,,,"https://opendata.rdw.nl/resource/3huj-srit.json","https://opendata.rdw.nl/resource/8ys7-d773.json","https://opendata.rdw.nl/resource/vezc-m2t6.json","https://opendata.rdw.nl/resource/jhie-znh9.json","https://opendata.rdw.nl/resource/kmfi-hrps.json"
"KS085H","Personenauto","JAGUAR LAND ROVER","DISCOVERY","20250112","20191210","32333","stationwagen","7","GRIJS","Niet geregistreerd","6","2993","2469","3280","2569","750","3500","20150609","20161116","Geen verstrekking in Open Data","118189","Nee",,,,,,,"4","4","0","0",,"0","0","M1",,,"tegen r. balk a. vooras","3280","LA",,"e11*2001/116*0233*20","S4KW2F","E7L1","0","0.07","289","Ja","Nee",,"Nee","6780","0","0.00","2024","Onlogisch","04","Nee","2025-01-12T00:00:00.000","2019-12-10T00:00:00.000","2015-06-09T00:00:00.000","2016-11-16T00:00:00.000",,,,,,,,,,,,,,,,,,,,,"G",,,,,,,"https://opendata.rdw.nl/resource/3huj-srit.json","https://opendata.rdw.nl/resource/8ys7-d773.json","https://opendata.rdw.nl/resource/vezc-m2t6.json","https://opendata.rdw.nl/resource/jhie-znh9.json","https://opendata.rdw.nl/resource/kmfi-hrps.json"
"NT614G","Personenauto","JAGUAR LAND ROVER","DISCOVERY","20250219","20240304","21860","stationwagen","7","ZWART","Niet geregistreerd","6","2993","2475","3260","2575","750","3500","20131129","20170412","Geen verstrekking in Open Data","98199","Ja",,,,,,,"4","4","0","0",,"0","0","M1",,,"tegen r. balk a. vooras","3260","LA",,"e11*2001/116*0233*17","S4KW2F","E7K1","0","0.07","289","Ja","Nee",,"Nee","6760","0","0.00","2024","Geen oordeel","05","Nee","2025-02-19T00:00:00.000","2024-03-04T00:00:00.000","2013-11-29T00:00:00.000","2017-04-12T00:00:00.000",,,,,,,,,,,,,,,,,,,,,"F",,,,,,,"https://opendata.rdw.nl/resource/3huj-srit.json","https://opendata.rdw.nl/resource/8ys7-d773.json","https://opendata.rdw.nl/resource/vezc-m2t6.json","https://opendata.rdw.nl/resource/jhie-znh9.json","https://opendata.rdw.nl/resource/kmfi-hrps.json"
"PH066D","Personenauto","JAGUAR LAND ROVER","DISCOVERY 3","20240106",,"2039","MPV","7","GRIJS","Niet geregistreerd","6","2720","2600","3230","2700","750","3500","20060614","20170623","Geen verstrekking in Open Data","65790","Ja",,,,,,,"4","4",,,,,,"M1",,,"r. balk a. vooras","3230",,,,,,,"0.05","288","Ja","Nee",,"Nee","6730",,,"2023","Geen oordeel","05","Nee","2024-01-06T00:00:00.000",,"2006-06-14T00:00:00.000","2017-06-23T00:00:00.000",,,,,,,,,,,,,,,,,,,,,,,,,,,,"https://opendata.rdw.nl/resource/3huj-srit.json","https://opendata.rdw.nl/resource/8ys7-d773.json","https://opendata.rdw.nl/resource/vezc-m2t6.json","https://opendata.rdw.nl/resource/jhie-znh9.json","https://opendata.rdw.nl/resource/kmfi-hrps.json"
"PV472V","Personenauto","JAGUAR LAND ROVER","DISCOVERY","20241024",,"21419","stationwagen","7","ZWART","Niet geregistreerd","6","2993","2475","3260","2575","750","3500","20131216","20171027","Geen verstrekking in Open Data","104849","Nee",,,,,,,"4","4","0","0",,"0","0","M1",,,"tegen r. balk a. vooras","3260","LA",,"e11*2001/116*0233*17","S4KW2F","E7K1","0","0.07","289","Ja","Nee",,"Nee","6760","0","0.00","2024","Geen oordeel","05","Nee","2024-10-24T00:00:00.000",,"2013-12-16T00:00:00.000","2017-10-27T00:00:00.000",,,,,,,,,,,,,,,,,,,,,"F",,,,,,,"https://opendata.rdw.nl/resource/3huj-srit.json","https://opendata.rdw.nl/resource/8ys7-d773.json","https://opendata.rdw.nl/resource/vezc-m2t6.json","https://opendata.rdw.nl/resource/jhie-znh9.json","https://opendata.rdw.nl/resource/kmfi-hrps.json"
"V007JG","Bedrijfsauto","JAGUAR LAND ROVER","DISCOVERY","20231117",,"22237","gesloten opbouw","2","N.v.t.","N.v.t.","6","2993","2535","3240","2635","750",,"20140311","20170919","Geen verstrekking in Open Data","92732","Nee",,"705",,"3500","3500",,,"4",,,,,"192","N1",,,"tegen r. balk a. vooras","3240","LA",,,,,,"0.07","289","Ja","Nee",,"Nee","6740",,,"2022","Onlogisch","04","Nee","2023-11-17T00:00:00.000",,"2014-03-11T00:00:00.000","2017-09-19T00:00:00.000",,"0",,,,,,,,,,,,,,,,,,,,,,,,,,"https://opendata.rdw.nl/resource/3huj-srit.json","https://opendata.rdw.nl/resource/8ys7-d773.json","https://opendata.rdw.nl/resource/vezc-m2t6.json","https://opendata.rdw.nl/resource/jhie-znh9.json","https://opendata.rdw.nl/resource/kmfi-hrps.json"
"VDZ77L","Bedrijfsauto","JAGUAR LAND ROVER","DISCOVERY","20240224","20240223","16818","gesloten opbouw","2","N.v.t.","N.v.t.","6","2993","2530","3240","2630","750",,"20140922","20200114","Geen verstrekking in Open Data","69920","Ja","180","710",,"3500","3500",,"4","4",,,,,"192","N1",,,"tegen r. balk a. vooras","3240","LA",,,,,,"0.07","289","Ja","Nee",,"Nee","6740",,,"2024","Geen oordeel","05","Nee","2024-02-24T00:00:00.000","2024-02-23T00:00:00.000","2014-09-22T00:00:00.000","2020-01-14T00:00:00.000",,,,,,,,,,,,,,,,,,,,,,,,,,,,"https://opendata.rdw.nl/resource/3huj-srit.json","https://opendata.rdw.nl/resource/8ys7-d773.json","https://opendata.rdw.nl/resource/vezc-m2t6.json","https://opendata.rdw.nl/resource/jhie-znh9.json","https://opendata.rdw.nl/resource/kmfi-hrps.json"
"VKB82X","Bedrijfsauto","JAGUAR LAND ROVER","DISCOVERY 4","20240507",,"33976","gesloten opbouw","2","N.v.t.","N.v.t.","6","2993","2523","3240","2623","750",,"20130723","20210408","Geen verstrekking in Open Data","142150","Nee","180","717",,"3500","3500",,"4","4",,,,,"192","N1",,,"tegen r. balk a. vooras","3240","LA",,,,,,"0.07","289","Ja","Nee",,"Nee","6740",,,"2024","Geen oordeel","05","Nee","2024-05-07T00:00:00.000",,"2013-07-23T00:00:00.000","2021-04-08T00:00:00.000",,,,,,,,,,,,,,,,,,,,,,,,,,,,"https://opendata.rdw.nl/resource/3huj-srit.json","https://opendata.rdw.nl/resource/8ys7-d773.json","https://opendata.rdw.nl/resource/vezc-m2t6.json","https://opendata.rdw.nl/resource/jhie-znh9.json","https://opendata.rdw.nl/resource/kmfi-hrps.json"
"XX644X","Personenauto","JAGUAR LAND ROVER","DISCOVERY","20240617",,"28260","stationwagen","5","GRIJS","Niet geregistreerd","6","2993","2550","3240","2650","750","3500","20140902","20160609","Geen verstrekking in Open Data","99759","Nee",,,,,,,"4","4",,,,,,"M1",,,"tegen r. balk a. vooras","3240","LA",,,,,,"0.06","289","Ja","Nee",,"Nee","6740",,,"2023","Geen oordeel","05","Nee","2024-06-17T00:00:00.000",,"2014-09-02T00:00:00.000","2016-06-09T00:00:00.000",,,,,,,,,,,,,,,,,,,,,,,,,,,,"https://opendata.rdw.nl/resource/3huj-srit.json","https://opendata.rdw.nl/resource/8ys7-d773.json","https://opendata.rdw.nl/resource/vezc-m2t6.json","https://opendata.rdw.nl/resource/jhie-znh9.json","https://opendata.rdw.nl/resource/kmfi-hrps.json"
"ZP452L","Personenauto","JAGUAR LAND ROVER","DISCOVERY SPORT","20240209",,"17755","stationwagen","7","BRUIN","Niet geregistreerd","4","2179","1833","2600","1933","750","2200","20150225","20190703","Geen verstrekking in Open Data","72974","Nee","180",,,,,,"5","4","0","0",,"0","189","M1",,,,"2600","LC",,"e11*2007/46*1659*01","S5AB2F","A7D1","0","0.07","274","Ja","Nee",,"Nee","4800","0","0.00","2024","Geen oordeel","05","Nee","2024-02-09T00:00:00.000",,"2015-02-25T00:00:00.000","2019-07-03T00:00:00.000",,,,,,,,,,,,,,,,,,,,,"F",,,,,,,"https://opendata.rdw.nl/resource/3huj-srit.json","https://opendata.rdw.nl/resource/8ys7-d773.json","https://opendata.rdw.nl/resource/vezc-m2t6.json","https://opendata.rdw.nl/resource/jhie-znh9.json","https://opendata.rdw.nl/resource/kmfi-hrps.json"
