"kenteken","voertuigsoort","merk","handelsbenaming","vervaldatum_apk","datum_tenaamstelling","bruto_bpm","inrichting","aantal_zitplaatsen","eerste_kleur","tweede_kleur","aantal_cilinders","cilinderinhoud","massa_ledig_voertuig","toegestane_maximum_massa_voertuig","massa_rijklaar","maximum_massa_trekken_ongeremd","maximum_trekken_massa_geremd","datum_eerste_toelating","datum_eerste_tenaamstelling_in_nederland","wacht_op_keuren","catalogusprijs","wam_verzekerd","maximale_constructiesnelheid","laadvermogen","oplegger_geremd","aanhangwagen_autonoom_geremd","aanhangwagen_middenas_geremd","aantal_staanplaatsen","aantal_deuren","aantal_wielen","afstand_hart_koppeling_tot_achterzijde_voertuig","afstand_voorzijde_voertuig_tot_hart_koppeling","afwijkende_maximum_snelheid","lengte","breedte","europese_voertuigcategorie","europese_voertuigcategorie_toevoeging","europese_uitvoeringcategorie_toevoeging","plaats_chassisnummer","technische_max_massa_voertuig","type","type_gasinstallatie","typegoedkeuringsnummer","variant","uitvoering","volgnummer_wijziging_eu_typegoedkeuring","vermogen_massarijklaar","wielbasis","export_indicator","openstaande_terugroepactie_indicator","vervaldatum_tachograaf","taxi_indicator","maximum_massa_samenstelling","aantal_rolstoelplaatsen","maximum_ondersteunende_snelheid","jaar_laatste_registratie_tellerstand","tellerstandoordeel","code_toelichting_tellerstandoordeel","tenaamstellen_mogelijk","vervaldatum_apk_dt","datum_tenaamstelling_dt","datum_eerste_toelating_dt","datum_eerste_tenaamstelling_in_nederland_dt","vervaldatum_tachograaf_dt","maximum_last_onder_de_vooras_sen_tezamen_koppeling","type_remsysteem_voertuig_code","rupsonderstelconfiguratiecode","wielbasis_voertuig_minimum","wielbasis_voertuig_maximum","lengte_voertuig_minimum","lengte_voertuig_maximum","breedte_voertuig_minimum","breedte_voertuig_maximum","hoogte_voertuig","hoogte_voertuig_minimum","hoogte_voertuig_maximum","massa_bedrijfsklaar_minimaal","massa_bedrijfsklaar_maximaal","technisch_toelaatbaar_massa_koppelpunt","maximum_massa_technisch_maximaal","maximum_massa_technisch_minimaal","subcategorie_nederland","verticale_belasting_koppelpunt_getrokken_voertuig","zuinigheidsclassificatie","registratie_datum_goedkeuring_afschrijvingsmoment_bpm","registratie_datum_goedkeuring_afschrijvingsmoment_bpm_dt","gem_lading_wrde","aerodyn_voorz","massa_alt_aandr","verl_cab_ind","api_gekentekende_voertuigen_assen","api_gekentekende_voertuigen_brandstof","api_gekentekende_voertuigen_carrosserie","api_gekentekende_voertuigen_carrosserie_specifiek","api_gekentekende_voertuigen_voertuigklasse"
"1KVZ02","Personenauto","FIAT","FIAT 500L","20240212",,"1750","MPV","5","WIT","Niet geregistreerd","2","875","1235","1820","1335","400","1000","20130731","20130731","Geen verstrekking in Open Data","23895","Nee",,,,,,,"4","4","0","0",,"415","0","M1",,,"r. bodemplaat by voorzitting","1820","199",,"e3*2001/116*0217*33","LYC1B","L2E","0","0.06","261","Ja","Nee",,"Nee","2820","0","0.00","2023","Logisch","00","Nee","2024-02-12T00:00:00.000",,"2013-07-31T00:00:00.000","2013-07-31T00:00:00.000",,,,,,,,,,,,,,,,,,,,,"A",,,,,,,"https://opendata.rdw.nl/resource/3huj-srit.json","https://opendata.rdw.nl/resource/8ys7-d773.json","https://opendata.rdw.nl/resource/vezc-m2t6.json","https://opendata.rdw.nl/resource/jhie-znh9.json","https://opendata.rdw.nl/resource/kmfi-hrps.json"
"1TGX75","Personenauto","FIAT","FIAT 500L","20230131",,"3255","MPV","5","GEEL","Niet geregistreerd","2","875","1245","1815","1345","400","1000","20140131","20140131","Geen verstrekking in Open Data","25245","Nee",,,,,,,"4","4","0","0",,"427","0","M1",,,"r. bodemplaat by voorzitting","1815","199",,"e3*2001/116*0217*33","LYC1B","L2G","0","0.06","261","Ja","Nee",,"Nee","2815","0","0.00","2022","Logisch","00","Nee","2023-01-31T00:00:00.000",,"2014-01-31T00:00:00.000","2014-01-31T00:00:00.000",,,,,,,,,,,,,,,,,,,,,"B",,,,,,,"https://opendata.rdw.nl/resource/3huj-srit.json","https://opendata.rdw.nl/resource/8ys7-d773.json","https://opendata.rdw.nl/resource/vezc-m2t6.json","https://opendata.rdw.nl/resource/jhie-znh9.json","https://opendata.rdw.nl/resource/kmfi-hrps.json"
"1TJX29","Personenauto","FIAT","FIAT 500L","20230729",,"6788","MPV","5","WIT","Niet geregistreerd","4","1598","1340","1925","1440","400","1100","20140228","20140228","Geen verstrekking in Open Data","30595","Nee",,,,,,,"4","4","0","0",,"415","0","M1",,,"r. bodemplaat by voorzitting","1925","199",,"e3*2001/116*0217*33","LYD1B","L4B","0","0.05","261","Ja","Nee",,"Nee","3025","0","0.00","2022","Logisch","00","Nee","2023-07-29T00:00:00.000",,"2014-02-28T00:00:00.000","2014-02-28T00:00:00.000",,,,,,,,,,,,,,,,,,,,,"E",,,,,,,"https://opendata.rdw.nl/resource/3huj-srit.json","https://opendata.rdw.nl/resource/8ys7-d773.json","https://opendata.rdw.nl/resource/vezc-m2t6.json","https://opendata.rdw.nl/resource/jhie-znh9.json","https://opendata.rdw.nl/resource/kmfi-hrps.json"
"1TJX30","Personenauto","FIAT","FIAT 500L","20240908","20240130","2520","MPV","5","GRIJS","Niet geregistreerd","2","875","1265","1805","1365","400","1000","20140228","20140228","Geen verstrekking in Open Data","23520","Ja",,,,,,,"4","4","0","0",,"435","0","M1",,,"r. bodemplaat by voorzitting","1805","199",,"e3*2001/116*0217*34","LYC1B","L2H","0","0.06","261","Ja","Nee",,"Nee","2805","0","0.00","2024","Logisch","00","Nee","2024-09-08T00:00:00.000","2024-01-30T00:00:00.000","2014-02-28T00:00:00.000","2014-02-28T00:00:00.000",,,,,,,,,,,,,,,,,,,,,"A",,,,,,,"https://opendata.rdw.nl/resource/3huj-srit.json","https://opendata.rdw.nl/resource/8ys7-d773.json","https://opendata.rdw.nl/resource/vezc-m2t6.json","https://opendata.rdw.nl/resource/jhie-znh9.json","https://opendata.rdw.nl/resource/kmfi-hrps.json"
"1TTB42","Personenauto","FIAT","FIAT 500L","20231222",,"2205","MPV","5","GRIJS","Niet geregistreerd","2","875","1235","1820","1335","400","1000","20140430","20140430","Geen verstrekking in Open Data","24170","Nee",,,,,,,"4","4","0","0",,"415","0","M1",,,"r. bodemplaat by voorzitting","1820","199",,"e3*2001/116*0217*32","LYC1B","L2E","0","0.06","261","Ja","Nee",,"Nee","2820","0","0.00","2022","Logisch","00","Nee","2023-12-22T00:00:00.000",,"2014-04-30T00:00:00.000","2014-04-30T00:00:00.000",,,,,,,,,,,,,,,,,,,,,"A",,,,,,,"https://opendata.rdw.nl/resource/3huj-srit.json","https://opendata.rdw.nl/resource/8ys7-d773.json","https://opendata.rdw.nl/resource/vezc-m2t6.json","https://opendata.rdw.nl/resource/jhie-znh9.json","https://opendata.rdw.nl/resource/kmfi-hrps.json"
"1TTB46","Personenauto","FIAT","FIAT 500L","20230504",,"1785","MPV","5","BEIGE","Niet geregistreerd","2","875","1395","1920","1495",,,"20140430","20140430","Geen verstrekking in Open Data","25395","Nee",,,,,,,"4","4","0","0",,"435","0","M1",,,"r. bodemplaat by voorzitting","1920","199","Af-fabriek gasinstallatie","e3*2001/116*0217*35","LYA1B","L5F","0","0.04","261","Ja","Nee",,"Nee","0","0",,"2023","Logisch","00","Nee","2023-05-04T00:00:00.000",,"2014-04-30T00:00:00.000","2014-04-30T00:00:00.000",,,,,,,,,,,,,,,,,,,,,"A",,,,,,,"https://opendata.rdw.nl/resource/3huj-srit.json","https://opendata.rdw.nl/resource/8ys7-d773.json","https://opendata.rdw.nl/resource/vezc-m2t6.json","https://opendata.rdw.nl/resource/jhie-znh9.json","https://opendata.rdw.nl/resource/kmfi-hrps.json"
"2491RL","Personenauto","FIAT","500L",,,,"sedan",,"GEEL","Niet geregistreerd","2","500","514",,"614",,,"19710323","19710323","Geen verstrekking in Open Data",,"Nee",,,,,,,"2","4","0","0",,"0","0","M1",,,"r. tegen schutbord in kofferruimte","0",,,,,,"0","0.03","184","Ja","Nee",,"Nee","0",,,"2022","Geen oordeel","01","Nee",,,"1971-03-23T00:00:00.000","1971-03-23T00:00:00.000",,"0",,,,,,,,,,,,,,,,,,,,,,,,,,"https://opendata.rdw.nl/resource/3huj-srit.json","https://opendata.rdw.nl/resource/8ys7-d773.json","https://opendata.rdw.nl/resource/vezc-m2t6.json","https://opendata.rdw.nl/resource/jhie-znh9.json","https://opendata.rdw.nl/resource/kmfi-hrps.json"
"2TGG86","Personenauto","FIAT","FIAT 500L","20240125",,"6788","MPV","5","GRIJS","Niet geregistreerd","4","1598","1340","1925","1440","400","1100","20140125","20140125","Geen verstrekking in Open Data","27195","Nee",,,,,,,"4","4","0","0",,"415","0","M1",,,"r. bodemplaat by voorzitting","1925","199",,"e3*2001/116*0217*33","LYD1B","L4B","0","0.05","261","Ja","Nee",,"Nee","3025","0","0.00","2023","Logisch","00","Nee","2024-01-25T00:00:00.000",,"2014-01-25T00:00:00.000","2014-01-25T00:00:00.000",,,,,,,,,,,,,,,,,,,,,"E",,,,,,,"https://opendata.rdw.nl/resource/3huj-srit.json","https://opendata.rdw.nl/resource/8ys7-d773.json","https://opendata.rdw.nl/resource/vezc-m2t6.json","https://opendata.rdw.nl/resource/jhie-znh9.json","https://opendata.rdw.nl/resource/kmfi-hrps.json"
"2TGG88","Personenauto","FIAT","FIAT 500L","20230731",,"5542","MPV","7","GRIJS","Niet geregistreerd","4","1248","1280","2020","1380","400","1000","20140124","20140124","Geen verstrekking in Open Data","29845","Nee",,,,,,,"4","4","0","0",,"435","0","M1",,,"r. bodemplaat by voorzitting","2020","199",,"e3*2001/116*0217*38","LXY1A","L0F","1","0.04","261","Ja","Nee",,"Nee","3020","0","0.00","2023","Logisch","00","Nee","2023-07-31T00:00:00.000",,"2014-01-24T00:00:00.000","2014-01-24T00:00:00.000",,,,,,,,,,,,,,,,,,,,,"D",,,,,,,"https://opendata.rdw.nl/resource/3huj-srit.json","https://opendata.rdw.nl/resource/8ys7-d773.json","https://opendata.rdw.nl/resource/vezc-m2t6.json","https://opendata.rdw.nl/resource/jhie-znh9.json","https://opendata.rdw.nl/resource/kmfi-hrps.json"
"2XDN80","Personenauto","FIAT","FIAT 500L","20230704",,"5542","MPV","5","WIT","Niet geregistreerd","4","1248","1270","1845","1370","400","1000","20140630","20140630","Geen verstrekking in Open Data","29745","Nee",,,,,,,"4","4","0","0",,"415","0","M1",,,"r. bodemplaat by voorzitting","1845","199",,"e3*2001/116*0217*38","LXY1A","L0H","1","0.05","261","Ja","Nee",,"Nee","2845","0","0.00","2023","Logisch","00","Nee","2023-07-04T00:00:00.000",,"2014-06-30T00:00:00.000","2014-06-30T00:00:00.000",,,,,,,,,,,,,,,,,,,,,"D",,,,,,,"https://opendata.rdw.nl/resource/3huj-srit.json","https://opendata.rdw.nl/resource/8ys7-d773.json","https://opendata.rdw.nl/resource/vezc-m2t6.json","https://opendata.rdw.nl/resource/jhie-znh9.json","https://opendata.rdw.nl/resource/kmfi-hrps.json"
"2XDN86","Personenauto","FIAT","FIAT 500L","20221229",,"1785","MPV","5","ROOD","Niet geregistreerd","2","875","1395","1920","1495",,,"20140630","20140630","Geen verstrekking in Open Data","28845","Nee",,,,,,,"4","4","0","0",,"435","0","M1",,,"r. bodemplaat by voorzitting","1920","199","Af-fabriek gasinstallatie","e3*2001/116*0217*35","LYA1B","L5F","0","0.04","261","Ja","Nee",,"Nee","0","0",,"2023","Logisch","03","Nee","2022-12-29T00:00:00.000",,"2014-06-30T00:00:00.000","2014-06-30T00:00:00.000",,,,,,,,,,,,,,,,,,,,,"A",,,,,,,"https://opendata.rdw.nl/resource/3huj-srit.json","https://opendata.rdw.nl/resource/8ys7-d773.json","https://opendata.rdw.nl/resource/vezc-m2t6.json","https://opendata.rdw.nl/resource/jhie-znh9.json","https://opendata.rdw.nl/resource/kmfi-hrps.json"
"2ZFN77","Personenauto","FIAT","FIAT 500L",,,"2205","MPV","5","GROEN","Niet geregistreerd","2","875","1235","1820","1335","400","1000","20141229","20141229","Geen verstrekking in Open Data","24695","Nee",,,,,,,"4","4","0","0",,"415","0","M1",,,"r. bodemplaat by voorzitting","1820","199",,"e3*2001/116*0217*33","LYC1B","L2E","0","0.06","261","Ja","Nee",,"Nee","2820","0","0.00","2020","Logisch","00","Nee",,,"2014-12-29T00:00:00.000","2014-12-29T00:00:00.000",,,,,,,,,,,,,,,,,,,,,"A",,,,,,,"https://opendata.rdw.nl/resource/3huj-srit.json","https://opendata.rdw.nl/resource/8ys7-d773.json","https://opendata.rdw.nl/resource/vezc-m2t6.json","https://opendata.rdw.nl/resource/jhie-znh9.json","https://opendata.rdw.nl/resource/kmfi-hrps.json"
"2ZFN78","Personenauto","FIAT","FIAT 500L","20240129",,"2520","MPV","7","ZWART","Niet geregistreerd","2","875","1295","1965","1395","400","1000","20141220","20141220","Geen verstrekking in Open Data","24995","Nee",,,,,,,"4","4","0","0",,"435","0","M1",,,"r. bodemplaat by voorzitting","1965","199",,"e3*2001/116*0217*41","LYC1B","L2L","0","0.06","261","Ja","Nee",,"Nee","2965","0","0.00","2023","Logisch","00","Nee","2024-01-29T00:00:00.000",,"2014-12-20T00:00:00.000","2014-12-20T00:00:00.000",,,,,,,,,,,,,,,,,,,,,"A",,,,,,,"https://opendata.rdw.nl/resource/3huj-srit.json","https://opendata.rdw.nl/resource/8ys7-d773.json","https://opendata.rdw.nl/resource/vezc-m2t6.json","https://opendata.rdw.nl/resource/jhie-znh9.json","https://opendata.rdw.nl/resource/kmfi-hrps.json"
"2ZSV26","Personenauto","FIAT","FIAT 500L","20240930","20240206","2254","MPV","5","WIT","Niet geregistreerd","2","875","1365","1895","1465",,,"20150320","20150320","Geen verstrekking in Open Data","23545","Nee",,,,,,,"4","4","0","0",,"415","0","M1",,,"r. bodemplaat by voorzitting","1895","199","Af-fabriek gasinstallatie","e3*2001/116*0217*41","LYA1B","L5E","0","0.04","261","Ja","Nee",,"Nee","0","0",,"2024","Logisch","00","Nee","2024-09-30T00:00:00.000","2024-02-06T00:00:00.000","2015-03-20T00:00:00.000","2015-03-20T00:00:00.000",,,,,,,,,,,,,,,,,,,,,"A",,,,,,,"https://opendata.rdw.nl/resource/3huj-srit.json","https://opendata.rdw.nl/resource/8ys7-d773.json","https://opendata.rdw.nl/resource/vezc-m2t6.json","https://opendata.rdw.nl/resource/jhie-znh9.json","https://opendata.rdw.nl/resource/kmfi-hrps.json"
"3676VN","Personenauto","FIAT","500L",,,,"Niet geregistreerd",,"ROOD","Niet geregistreerd","2",,"514",,"614",,,"19721124","19721124","Geen verstrekking in Open Data",,"Nee",,,,,,,"2","4","0","0",,"0","0","M1",,,"r. tegen schutbord in kofferruimte","0",,,,,,"0","0.00","184","Ja","Nee",,"Nee","0",,,"2023","Logisch","00","Nee",,,"1972-11-24T00:00:00.000","1972-11-24T00:00:00.000",,"0",,,,,,,,,,,,,,,,,,,,,,,,,,"https://opendata.rdw.nl/resource/3huj-srit.json","https://opendata.rdw.nl/resource/8ys7-d773.json","https://opendata.rdw.nl/resource/vezc-m2t6.json","https://opendata.rdw.nl/resource/jhie-znh9.json","https://opendata.rdw.nl/resource/kmfi-hrps.json"
"3TFB15","Personenauto","FIAT","FIAT 500L","20230204",,"3000","MPV","5","ZWART","Niet geregistreerd","2","875","1245","1815","1345","400","1000","20140204","20140204","Geen verstrekking in Open Data","24620","Nee",,,,,,,"4","4","0","0",,"427","0","M1",,,"r. bodemplaat by voorzitting","1815","199",,"e3*2001/116*0217*33","LYC1B","L2G","0","0.06","261","Ja","Nee",,"Nee","2815","0","0.00","2022","Logisch","00","Nee","2023-02-04T00:00:00.000",,"2014-02-04T00:00:00.000","2014-02-04T00:00:00.000",,,,,,,,,,,,,,,,,,,,,"B",,,,,,,"https://opendata.rdw.nl/resource/3huj-srit.json","https://opendata.rdw.nl/resource/8ys7-d773.json","https://opendata.rdw.nl/resource/vezc-m2t6.json","https://opendata.rdw.nl/resource/jhie-znh9.json","https://opendata.rdw.nl/resource/kmfi-hrps.json"
"3TFB24","Personenauto","FIAT","FIAT 500L","20230525",,"2125","MPV","7","GRIJS","Niet geregistreerd","2","875","1295","1965","1395","400","1000","20140130","20140130","Geen verstrekking in Open Data","25495","Nee",,,,,,,"4","4","0","0",,"435","0","M1",,,"r. bodemplaat by voorzitting","1965","199",,"e3*2001/116*0217*34","LYC1B","L2L","0","0.06","261","Ja","Nee",,"Nee","2965","0","0.00","2023","Logisch","00","Nee","2023-05-25T00:00:00.000",,"2014-01-30T00:00:00.000","2014-01-30T00:00:00.000",,,,,,,,,,,,,,,,,,,,,"A",,,,,,,"https://opendata.rdw.nl/resource/3huj-srit.json","https://opendata.rdw.nl/resource/8ys7-d773.json","https://opendata.rdw.nl/resource/vezc-m2t6.json","https://opendata.rdw.nl/resource/jhie-znh9.json","https://opendata.rdw.nl/resource/kmfi-hrps.json"
"3TLR42","Personenauto","FIAT","FIAT 500L","20230526",,"4653","MPV","7","BEIGE","Niet geregistreerd","4","1248","1285","2025","1385","400","1000","20140324","20140324","Geen verstrekking in Open Data","31295","Nee",,,,,,,"4","4","0","0",,"435","0","M1",,,"r. bodemplaat by voorzitting","2025","199",,"e3*2001/116*0217*38","LXY11","L3F","1","0.04","261","Ja","Nee",,"Nee","3025","0","0.00","2022","Onlogisch","04","Nee","2023-05-26T00:00:00.000",,"2014-03-24T00:00:00.000","2014-03-24T00:00:00.000",,,,,,,,,,,,,,,,,,,,,"D",,,,,,,"https://opendata.rdw.nl/resource/3huj-srit.json","https://opendata.rdw.nl/resource/8ys7-d773.json","https://opendata.rdw.nl/resource/vezc-m2t6.json","https://opendata.rdw.nl/resource/jhie-znh9.json","https://opendata.rdw.nl/resource/kmfi-hrps.json"
"3TPT60","Personenauto","FIAT","FIAT 500L","20230423",,"2520","MPV","7","BEIGE","Niet geregistreerd","2","875","1295","1965","1395","400","1000","20140416","20140416","Geen verstrekking in Open Data","22995","Nee",,,,,,,"4","4","0","0",,"435","0","M1",,,"r. bodemplaat by voorzitting","1965","199",,"e3*2001/116*0217*34","LYC1B","L2L","0","0.06","261","Ja","Nee",,"Nee","2965","0","0.00","2024","Logisch","00","Nee","2023-04-23T00:00:00.000",,"2014-04-16T00:00:00.000","2014-04-16T00:00:00.000",,,,,,,,,,,,,,,,,,,,,"A",,,,,,,"https://opendata.rdw.nl/resource/3huj-srit.json","https://opendata.rdw.nl/resource/8ys7-d773.json","https://opendata.rdw.nl/resource/vezc-m2t6.json","https://opendata.rdw.nl/resource/jhie-znh9.json","https://opendata.rdw.nl/resource/kmfi-hrps.json"
"4KHH09","Personenauto","FIAT","FIAT 500L","20230611",,"1750","MPV","5","ZWART","Niet geregistreerd","2","875","1235","1820","1335","400","1000","20130422","20130422","Geen verstrekking in Open Data","22570","Nee",,,,,,,"4","4","0","0",,"415","0","M1",,,"r. bodemplaat by voorzitting","1820","199",,"e3*2001/116*0217*32","LYC1B","L2E","0","0.06","261","Ja","Nee",,"Nee","2820","0","0.00","2022","Logisch","00","Nee","2023-06-11T00:00:00.000",,"2013-04-22T00:00:00.000","2013-04-22T00:00:00.000",,,,,,,,,,,,,,,,,,,,,"A",,,,,,,"https://opendata.rdw.nl/resource/3huj-srit.json","https://opendata.rdw.nl/resource/8ys7-d773.json","https://opendata.rdw.nl/resource/vezc-m2t6.json","https://opendata.rdw.nl/resource/jhie-znh9.json","https://opendata.rdw.nl/resource/kmfi-hrps.json"
"4KKT64","Personenauto","FIAT","FIAT 500L","20231101",,"4083","MPV","5","WIT","Niet geregistreerd","4","1248","1275","1850","1375","400","1000","20130524","20130524","Geen verstrekking in Open Data","23589","Nee",,,,,,,"4","4","0","0",,"415","0","M1",,,"r. bodemplaat by voorzitting","1850","199",,"e3*2001/116*0217*33","LXY11","L3H","0","0.05","261","Ja","Nee",,"Nee","2850","0","0.00","2023","Geen oordeel","05","Nee","2023-11-01T00:00:00.000",,"2013-05-24T00:00:00.000","2013-05-24T00:00:00.000",,,,,,,,,,,,,,,,,,,,,"B","20220908","2022-09-08T00:00:00.000",,,,,"https://opendata.rdw.nl/resource/3huj-srit.json","https://opendata.rdw.nl/resource/8ys7-d773.json","https://opendata.rdw.nl/resource/vezc-m2t6.json","https://opendata.rdw.nl/resource/jhie-znh9.json","https://opendata.rdw.nl/resource/kmfi-hrps.json"
"4SBR42","Personenauto","FIAT","FIAT 500L","20240831",,"3000","MPV","5","GEEL","Niet geregistreerd","2","875","1245","1815","1345","400","1000","20130831","20130831","Geen verstrekking in Open Data","24770","Nee",,,,,,,"4","4","0","0",,"427","0","M1",,,"r. bodemplaat by voorzitting","1815","199",,"e3*2001/116*0217*33","LYC1B","L2G","0","0.06","261","Ja","Nee",,"Nee","2815","0","0.00","2023","Logisch","00","Nee","2024-08-31T00:00:00.000",,"2013-08-31T00:00:00.000","2013-08-31T00:00:00.000",,,,,,,,,,,,,,,,,,,,,"A",,,,,,,"https://opendata.rdw.nl/resource/3huj-srit.json","https://opendata.rdw.nl/resource/8ys7-d773.json","https://opendata.rdw.nl/resource/vezc-m2t6.json","https://opendata.rdw.nl/resource/jhie-znh9.json","https://opendata.rdw.nl/resource/kmfi-hrps.json"
"4SNZ50","Personenauto","FIAT","FIAT 500L","20231129",,"3000","MPV","5","ZWART","Niet geregistreerd","2","875","1245","1815","1345","400","1000","20131115","20131115","Geen verstrekking in Open Data","24395","Nee",,,,,,,"4","4","0","0",,"427","0","M1",,,"r. bodemplaat by voorzitting","1815","199",,"e3*2001/116*0217*33","LYC1B","L2G","0","0.06","261","Ja","Nee",,"Nee","2815","0","0.00","2022","Logisch","00","Nee","2023-11-29T00:00:00.000",,"2013-11-15T00:00:00.000","2013-11-15T00:00:00.000",,,,,,,,,,,,,,,,,,,,,"A",,,,,,,"https://opendata.rdw.nl/resource/3huj-srit.json","https://opendata.rdw.nl/resource/8ys7-d773.json","https://opendata.rdw.nl/resource/vezc-m2t6.json","https://opendata.rdw.nl/resource/jhie-znh9.json","https://opendata.rdw.nl/resource/kmfi-hrps.json"
"4TKV96","Personenauto","FIAT","FIAT 500L","20230320",,"2205","MPV","5","WIT","Niet geregistreerd","2","875","1235","1820","1335","400","1000","20140320","20140320","Geen verstrekking in Open Data","24495","Nee",,,,,,,"4","4","0","0",,"415","0","M1",,,"r. bodemplaat by voorzitting","1820","199",,"e3*2001/116*0217*33","LYC1B","L2E","0","0.06","261","Ja","Nee",,"Nee","2820","0","0.00","2023","Logisch","00","Nee","2023-03-20T00:00:00.000",,"2014-03-20T00:00:00.000","2014-03-20T00:00:00.000",,,,,,,,,,,,,,,,,,,,,"A",,,,,,,"https://opendata.rdw.nl/resource/3huj-srit.json","https://opendata.rdw.nl/resource/8ys7-d773.json","https://opendata.rdw.nl/resource/vezc-m2t6.json","https://opendata.rdw.nl/resource/jhie-znh9.json","https://opendata.rdw.nl/resource/kmfi-hrps.json"
"4XBS13","Personenauto","FIAT","FIAT 500L","20230417",,"4653","MPV","5","GROEN","Niet geregistreerd","4","1248","1295","1870","1395","400","1000","20140627","20140627","Geen verstrekking in Open Data","31045","Nee",,,,,,,"4","4","0","0",,"435","0","M1",,,"r. bodemplaat by voorzitting","1870","199",,"e3*2001/116*0217*38","LXY11","L3E","1","0.04","261","Ja","Nee",,"Nee","2870","0","0.00","2023","Logisch","00","Nee","2023-04-17T00:00:00.000",,"2014-06-27T00:00:00.000","2014-06-27T00:00:00.000",,,,,,,,,,,,,,,,,,,,,"D",,,,,,,"https://opendata.rdw.nl/resource/3huj-srit.json","https://opendata.rdw.nl/resource/8ys7-d773.json","https://opendata.rdw.nl/resource/vezc-m2t6.json","https://opendata.rdw.nl/resource/jhie-znh9.json","https://opendata.rdw.nl/resource/kmfi-hrps.json"
"5TPL42","Personenauto","FIAT","FIAT 500L","20240424",,"4653","MPV","5","ROOD","Niet geregistreerd","4","1248","1275","1850","1375","400","1000","20140407","20140407","Geen verstrekking in Open Data","28945","Nee",,,,,,,"4","4","0","0",,"415","0","M1",,,"r. bodemplaat by voorzitting","1850","199",,"e3*2001/116*0217*38","LXY11","L3H","1","0.05","261","Ja","Nee",,"Nee","2850","0","0.00","2023","Logisch","00","Nee","2024-04-24T00:00:00.000",,"2014-04-07T00:00:00.000","2014-04-07T00:00:00.000",,,,,,,,,,,,,,,,,,,,,"D",,,,,,,"https://opendata.rdw.nl/resource/3huj-srit.json","https://opendata.rdw.nl/resource/8ys7-d773.json","https://opendata.rdw.nl/resource/vezc-m2t6.json","https://opendata.rdw.nl/resource/jhie-znh9.json","https://opendata.rdw.nl/resource/kmfi-hrps.json"
"6KZG56","Personenauto","FIAT","FIAT 500L","20230329",,"4995","MPV","5","WIT","Niet geregistreerd","4","1248","1270","1845","1370","400","1000","20130815","20130815","Geen verstrekking in Open Data","24695","Nee",,,,,,,"4","4","0","0",,"415","0","M1",,,"r. bodemplaat by voorzitting","1845","199",,"e3*2001/116*0217*33","LXY1A","L0H","0","0.05","261","Ja","Nee",,"Nee","2845","0","0.00","2022","Logisch","00","Nee","2023-03-29T00:00:00.000",,"2013-08-15T00:00:00.000","2013-08-15T00:00:00.000",,,,,,,,,,,,,,,,,,,,,"B",,,,,,,"https://opendata.rdw.nl/resource/3huj-srit.json","https://opendata.rdw.nl/resource/8ys7-d773.json","https://opendata.rdw.nl/resource/vezc-m2t6.json","https://opendata.rdw.nl/resource/jhie-znh9.json","https://opendata.rdw.nl/resource/kmfi-hrps.json"