"kenteken","voertuigsoort","merk","handelsbenaming","vervaldatum_apk","datum_tenaamstelling","bruto_bpm","inrichting","aantal_zitplaatsen","eerste_kleur","tweede_kleur","aantal_cilinders","cilinderinhoud","massa_ledig_voertuig","toegestane_maximum_massa_voertuig","massa_rijklaar","maximum_massa_trekken_ongeremd","maximum_trekken_massa_geremd","datum_eerste_toelating","datum_eerste_tenaamstelling_in_nederland","wacht_op_keuren","catalogusprijs","wam_verzekerd","maximale_constructiesnelheid","laadvermogen","oplegger_geremd","aanhangwagen_autonoom_geremd","aanhangwagen_middenas_geremd","aantal_staanplaatsen","aantal_deuren","aantal_wielen","afstand_hart_koppeling_tot_achterzijde_voertuig","afstand_voorzijde_voertuig_tot_hart_koppeling","afwijkende_maximum_snelheid","lengte","breedte","europese_voertuigcategorie","europese_voertuigcategorie_toevoeging","europese_uitvoeringcategorie_toevoeging","plaats_chassisnummer","technische_max_massa_voertuig","type","type_gasinstallatie","typegoedkeuringsnummer","variant","uitvoering","volgnummer_wijziging_eu_typegoedkeuring","vermogen_massarijklaar","wielbasis","export_indicator","openstaande_terugroepactie_indicator","vervaldatum_tachograaf","taxi_indicator","maximum_massa_samenstelling","aantal_rolstoelplaatsen","maximum_ondersteunende_snelheid","jaar_laatste_registratie_tellerstand","tellerstandoordeel","code_toelichting_tellerstandoordeel","tenaamstellen_mogelijk","vervaldatum_apk_dt","datum_tenaamstelling_dt","datum_eerste_toelating_dt","datum_eerste_tenaamstelling_in_nederland_dt","vervaldatum_tachograaf_dt","maximum_last_onder_de_vooras_sen_tezamen_koppeling","type_remsysteem_voertuig_code","rupsonderstelconfiguratiecode","wielbasis_voertuig_minimum","wielbasis_voertuig_maximum","lengte_voertuig_minimum","lengte_voertuig_maximum","breedte_voertuig_minimum","breedte_voertuig_maximum","hoogte_voertuig","hoogte_voertuig_minimum","hoogte_voertuig_maximum","massa_bedrijfsklaar_minimaal","massa_bedrijfsklaar_maximaal","technisch_toelaatbaar_massa_koppelpunt","maximum_massa_technisch_maximaal","maximum_massa_technisch_minimaal","subcategorie_nederland","verticale_belasting_koppelpunt_getrokken_voertuig","zuinigheidsclassificatie","registratie_datum_goedkeuring_afschrijvingsmoment_bpm","registratie_datum_goedkeuring_afschrijvingsmoment_bpm_dt","gem_lading_wrde","aerodyn_voorz","massa_alt_aandr","verl_cab_ind","api_gekentekende_voertuigen_assen","api_gekentekende_voertuigen_brandstof","api_gekentekende_voertuigen_carrosserie","api_gekentekende_voertuigen_carrosserie_specifiek","api_gekentekende_voertuigen_voertuigklasse"
"VFT77L","Bedrijfsauto","DFSK","K01H",,,,"neerklapbare zijschotten","2","N.v.t.","N.v.t.",,,"1015","1865","1115",,,"20220830","20220830","Geen verstrekking in Open Data","40716","Nee",,"850",,,,,"2","4",,,,"428","156","N1",,,"r. balk by vooras","1865","CLH",,,,,,"0.01","276","Ja","Nee",,"Nee",,,,"2022","Logisch","00","Nee",,,"2022-08-30T00:00:00.000","2022-08-30T00:00:00.000",,,,,,,,,,,"185",,,,,,,,,,,,,,,,,"https://opendata.rdw.nl/resource/3huj-srit.json","https://opendata.rdw.nl/resource/8ys7-d773.json","https://opendata.rdw.nl/resource/vezc-m2t6.json","https://opendata.rdw.nl/resource/jhie-znh9.json","https://opendata.rdw.nl/resource/kmfi-hrps.json"
"VH945Z","Bedrijfsauto","DFSK","K01H","20230525",,"2800","kipper","2","N.v.t.","N.v.t.","4","1012","1100","1855","1200",,,"20140522","20140522","Geen verstrekking in Open Data","10830","Nee",,"755",,,,,"0","4","0","0",,"428","156","N1",,,"r. bodemplaat by voorzitting","1855","CLV",,"e4*2007/46*0464*04","CLH","A","0","0.03","276","Ja","Nee",,"Nee","0","0",,"2023","Logisch","00","Nee","2023-05-25T00:00:00.000",,"2014-05-22T00:00:00.000","2014-05-22T00:00:00.000",,"0",,,,,,,,,,,,,,,,,,,,,,,,,,"https://opendata.rdw.nl/resource/3huj-srit.json","https://opendata.rdw.nl/resource/8ys7-d773.json","https://opendata.rdw.nl/resource/vezc-m2t6.json","https://opendata.rdw.nl/resource/jhie-znh9.json","https://opendata.rdw.nl/resource/kmfi-hrps.json"
"VH946Z","Bedrijfsauto","DFSK","K01H","20230428",,"2800","open wagen","2","N.v.t.","N.v.t.","4","1012","848","1855","948",,,"20140428","20140428","Geen verstrekking in Open Data","10830","Nee",,"1007",,,,,"0","4","0","0",,"428","156","N1",,,"r. bodemplaat by voorzitting","1855","CLV",,"e4*2007/46*0464*04","CLH","A","0","0.04","276","Ja","Nee",,"Nee","0","0",,"2023","Logisch","00","Nee","2023-04-28T00:00:00.000",,"2014-04-28T00:00:00.000","2014-04-28T00:00:00.000",,"0",,,,,,,,,,,,,,,,,,,,,,,,,,"https://opendata.rdw.nl/resource/3huj-srit.json","https://opendata.rdw.nl/resource/8ys7-d773.json","https://opendata.rdw.nl/resource/vezc-m2t6.json","https://opendata.rdw.nl/resource/jhie-znh9.json","https://opendata.rdw.nl/resource/kmfi-hrps.json"
"VJ621B","Bedrijfsauto","DFSK","K01H","20240922",,"3412","open laadvloer","2","N.v.t.","N.v.t.","4","1310","1120","1865","1220",,,"20140603","20140603","Geen verstrekking in Open Data","12455","Nee",,"745",,,,,"0","4","0","0",,"428","156","N1",,,"r. bodemplaat by voorzitting","1865","CLV",,"e4*2007/46*0464*04","CLH","B","0","0.05","276","Ja","Nee",,"Nee","0","0",,"2023","Onlogisch","04","Nee","2024-09-22T00:00:00.000",,"2014-06-03T00:00:00.000","2014-06-03T00:00:00.000",,"0",,,,,,,,,,,,,,,,,,,,,,,,,,"https://opendata.rdw.nl/resource/3huj-srit.json","https://opendata.rdw.nl/resource/8ys7-d773.json","https://opendata.rdw.nl/resource/vezc-m2t6.json","https://opendata.rdw.nl/resource/jhie-znh9.json","https://opendata.rdw.nl/resource/kmfi-hrps.json"
"VJ635B","Bedrijfsauto","DFSK","K01H","20230624",,"3412","open laadvloer","2","N.v.t.","N.v.t.","4","1310","1120","1865","1220",,,"20140610","20140610","Geen verstrekking in Open Data","12455","Ja",,"745",,,,,"0","4","0","0",,"428","156","N1",,,"r. bodemplaat by voorzitting","1865","CLV",,"e4*2007/46*0464*04","CLH","B","0","0.05","276","Ja","Nee",,"Nee","0","0",,"2022","Logisch","00","Nee","2023-06-24T00:00:00.000",,"2014-06-10T00:00:00.000","2014-06-10T00:00:00.000",,"0",,,,,,,,,,,,,,,,,,,,,,,,,,"https://opendata.rdw.nl/resource/3huj-srit.json","https://opendata.rdw.nl/resource/8ys7-d773.json","https://opendata.rdw.nl/resource/vezc-m2t6.json","https://opendata.rdw.nl/resource/jhie-znh9.json","https://opendata.rdw.nl/resource/kmfi-hrps.json"
"VN577P","Bedrijfsauto","DFSK","K01H","20230501",,"4743","kipper","2","N.v.t.","N.v.t.","4","1310","1120","1865","1220",,,"20150501","20150501","Geen verstrekking in Open Data","24085","Nee",,"745",,,,,,"4",,,,,"156","N1",,,"r. bodemplaat by voorzitting","1865","CLV",,,,,,"0.05","276","Ja","Nee",,"Nee",,,,"2023","Logisch","00","Nee","2023-05-01T00:00:00.000",,"2015-05-01T00:00:00.000","2015-05-01T00:00:00.000",,"0",,,,,,,,,,,,,,,,,,,,,,,,,,"https://opendata.rdw.nl/resource/3huj-srit.json","https://opendata.rdw.nl/resource/8ys7-d773.json","https://opendata.rdw.nl/resource/vezc-m2t6.json","https://opendata.rdw.nl/resource/jhie-znh9.json","https://opendata.rdw.nl/resource/kmfi-hrps.json"
"VN579P","Bedrijfsauto","DFSK","K01H","20240615",,"4743","kipper","2","N.v.t.","N.v.t.","4","1310","1120","1865","1220",,,"20150501","20150501","Geen verstrekking in Open Data","24085","Nee",,"745",,,,,,"4",,,,,"156","N1",,,"r. bodemplaat by voorzitting","1865","CLV",,,,,,"0.05","276","Ja","Nee",,"Nee",,,,"2023","Logisch","00","Nee","2024-06-15T00:00:00.000",,"2015-05-01T00:00:00.000","2015-05-01T00:00:00.000",,"0",,,,,,,,,,,,,,,,,,,,,,,,,,"https://opendata.rdw.nl/resource/3huj-srit.json","https://opendata.rdw.nl/resource/8ys7-d773.json","https://opendata.rdw.nl/resource/vezc-m2t6.json","https://opendata.rdw.nl/resource/jhie-znh9.json","https://opendata.rdw.nl/resource/kmfi-hrps.json"
"VR049K","Bedrijfsauto","DFSK","K01H",,,"6676","kipper","2","N.v.t.","N.v.t.","4","1310","1100","1865","1200",,,"20151209","20151209","Geen verstrekking in Open Data","25672","Nee",,"765",,,,,,"4",,,,,"156","N1",,,"r. bodemplaat by voorzitting","1865","CLV",,,,,,"0.05","276","Ja","Nee",,"Nee",,,,"2023","Logisch","00","Nee",,,"2015-12-09T00:00:00.000","2015-12-09T00:00:00.000",,"0",,,,,,,,,,,,,,,,,,,,,,,,,,"https://opendata.rdw.nl/resource/3huj-srit.json","https://opendata.rdw.nl/resource/8ys7-d773.json","https://opendata.rdw.nl/resource/vezc-m2t6.json","https://opendata.rdw.nl/resource/jhie-znh9.json","https://opendata.rdw.nl/resource/kmfi-hrps.json"
"VS281D","Bedrijfsauto","DFSK","K01H","20221018",,"5082","kipper","2","N.v.t.","N.v.t.","4","1310","1100","1865","1200",,,"20151209","20151209","Geen verstrekking in Open Data","25672","Nee",,"765",,,,,,"4",,,,,"156","N1",,,"r. bodemplaat by voorzitting","1865","CLV",,,,,,"0.05","276","Ja","Nee",,"Nee",,,,"2023","Logisch","00","Nee","2022-10-18T00:00:00.000",,"2015-12-09T00:00:00.000","2015-12-09T00:00:00.000",,"0",,,,,,,,,,,,,,,,,,,,,,,,,,"https://opendata.rdw.nl/resource/3huj-srit.json","https://opendata.rdw.nl/resource/8ys7-d773.json","https://opendata.rdw.nl/resource/vezc-m2t6.json","https://opendata.rdw.nl/resource/jhie-znh9.json","https://opendata.rdw.nl/resource/kmfi-hrps.json"
"VV042V","Bedrijfsauto","DFSK","K01H","20230623",,"4950","kipper","2","N.v.t.","N.v.t.","4","1310","1245","1865","1345",,,"20160623","20160623","Geen verstrekking in Open Data","24957","Nee",,"620",,,,,"2","4","0","0",,"0","156","N1",,,"r. bodemplaat by voorzitting","1865","CLV",,"e4*2007/46*0464*05","CLH","B","0","0.04","276","Ja","Nee",,"Nee","0","0","0.00","2022","Logisch","00","Nee","2023-06-23T00:00:00.000",,"2016-06-23T00:00:00.000","2016-06-23T00:00:00.000",,"0",,,,,,,,,,,,,,,,,,,,,,,,,,"https://opendata.rdw.nl/resource/3huj-srit.json","https://opendata.rdw.nl/resource/8ys7-d773.json","https://opendata.rdw.nl/resource/vezc-m2t6.json","https://opendata.rdw.nl/resource/jhie-znh9.json","https://opendata.rdw.nl/resource/kmfi-hrps.json"
"VV046V","Bedrijfsauto","DFSK","K01H","20230623",,"4950","kipper","2","N.v.t.","N.v.t.","4","1310","1229","1865","1329",,,"20160623","20160623","Geen verstrekking in Open Data","24957","Nee",,"636",,,,,"2","4","0","0",,"0","156","N1",,,"r. bodemplaat by voorzitting","1865","CLV",,"e4*2007/46*0464*05","CLH","B","0","0.04","276","Ja","Nee",,"Nee","0","0","0.00","2022","Logisch","00","Nee","2023-06-23T00:00:00.000",,"2016-06-23T00:00:00.000","2016-06-23T00:00:00.000",,"0",,,,,,,,,,,,,,,,,,,,,,,,,,"https://opendata.rdw.nl/resource/3huj-srit.json","https://opendata.rdw.nl/resource/8ys7-d773.json","https://opendata.rdw.nl/resource/vezc-m2t6.json","https://opendata.rdw.nl/resource/jhie-znh9.json","https://opendata.rdw.nl/resource/kmfi-hrps.json"
"VZ443G","Bedrijfsauto","DFSK","K01H","20240917",,"3706","open laadvloer","2","N.v.t.","N.v.t.","4","1310","858","1865","958",,,"20160916","20160916","Geen verstrekking in Open Data","19720","Nee",,"1007",,,,,,"4",,,,,"156","N1",,,"r. bodemplaat by voorzitting","1865","CLV",,,,,,"0.06","276","Ja","Nee",,"Nee",,,,"2023","Logisch","00","Nee","2024-09-17T00:00:00.000",,"2016-09-16T00:00:00.000","2016-09-16T00:00:00.000",,"0",,,,,,,,,,,,,,,,,,,,,,,,,,"https://opendata.rdw.nl/resource/3huj-srit.json","https://opendata.rdw.nl/resource/8ys7-d773.json","https://opendata.rdw.nl/resource/vezc-m2t6.json","https://opendata.rdw.nl/resource/jhie-znh9.json","https://opendata.rdw.nl/resource/kmfi-hrps.json"
"VZ531G","Bedrijfsauto","DFSK","K01H",,,"5327","open laadvloer","2","N.v.t.","N.v.t.","4","1310","858","1865","958",,,"20160916","20160916","Geen verstrekking in Open Data","26544","Nee",,"1007",,,,,,"4",,,,,"156","N1",,,"r. bodemplaat by voorzitting","1865","CLV",,,,,,"0.06","276","Ja","Nee",,"Nee",,,,"2022","Logisch","00","Nee",,,"2016-09-16T00:00:00.000","2016-09-16T00:00:00.000",,"0",,,,,,,,,,,,,,,,,,,,,,,,,,"https://opendata.rdw.nl/resource/3huj-srit.json","https://opendata.rdw.nl/resource/8ys7-d773.json","https://opendata.rdw.nl/resource/vezc-m2t6.json","https://opendata.rdw.nl/resource/jhie-znh9.json","https://opendata.rdw.nl/resource/kmfi-hrps.json"
