"kenteken","voertuigsoort","merk","handelsbenaming","vervaldatum_apk","datum_tenaamstelling","bruto_bpm","inrichting","aantal_zitplaatsen","eerste_kleur","tweede_kleur","aantal_cilinders","cilinderinhoud","massa_ledig_voertuig","toegestane_maximum_massa_voertuig","massa_rijklaar","maximum_massa_trekken_ongeremd","maximum_trekken_massa_geremd","datum_eerste_toelating","datum_eerste_tenaamstelling_in_nederland","wacht_op_keuren","catalogusprijs","wam_verzekerd","maximale_constructiesnelheid","laadvermogen","oplegger_geremd","aanhangwagen_autonoom_geremd","aanhangwagen_middenas_geremd","aantal_staanplaatsen","aantal_deuren","aantal_wielen","afstand_hart_koppeling_tot_achterzijde_voertuig","afstand_voorzijde_voertuig_tot_hart_koppeling","afwijkende_maximum_snelheid","lengte","breedte","europese_voertuigcategorie","europese_voertuigcategorie_toevoeging","europese_uitvoeringcategorie_toevoeging","plaats_chassisnummer","technische_max_massa_voertuig","type","type_gasinstallatie","typegoedkeuringsnummer","variant","uitvoering","volgnummer_wijziging_eu_typegoedkeuring","vermogen_massarijklaar","wielbasis","export_indicator","openstaande_terugroepactie_indicator","vervaldatum_tachograaf","taxi_indicator","maximum_massa_samenstelling","aantal_rolstoelplaatsen","maximum_ondersteunende_snelheid","jaar_laatste_registratie_tellerstand","tellerstandoordeel","code_toelichting_tellerstandoordeel","tenaamstellen_mogelijk","vervaldatum_apk_dt","datum_tenaamstelling_dt","datum_eerste_toelating_dt","datum_eerste_tenaamstelling_in_nederland_dt","vervaldatum_tachograaf_dt","maximum_last_onder_de_vooras_sen_tezamen_koppeling","type_remsysteem_voertuig_code","rupsonderstelconfiguratiecode","wielbasis_voertuig_minimum","wielbasis_voertuig_maximum","lengte_voertuig_minimum","lengte_voertuig_maximum","breedte_voertuig_minimum","breedte_voertuig_maximum","hoogte_voertuig","hoogte_voertuig_minimum","hoogte_voertuig_maximum","massa_bedrijfsklaar_minimaal","massa_bedrijfsklaar_maximaal","technisch_toelaatbaar_massa_koppelpunt","maximum_massa_technisch_maximaal","maximum_massa_technisch_minimaal","subcategorie_nederland","verticale_belasting_koppelpunt_getrokken_voertuig","zuinigheidsclassificatie","registratie_datum_goedkeuring_afschrijvingsmoment_bpm","registratie_datum_goedkeuring_afschrijvingsmoment_bpm_dt","gem_lading_wrde","aerodyn_voorz","massa_alt_aandr","verl_cab_ind","api_gekentekende_voertuigen_assen","api_gekentekende_voertuigen_brandstof","api_gekentekende_voertuigen_carrosserie","api_gekentekende_voertuigen_carrosserie_specifiek","api_gekentekende_voertuigen_voertuigklasse"
"1XSX46","Personenauto","BMW I","I8",,,,"coupe","4","GRIJS","Niet geregistreerd","3","1499","1460","1855","1560",,,"20141031","20141031","Geen verstrekking in Open Data","148999","Nee",,,,,,,"2","4","0","0",,"469","0","M1",,,"r. by voorzitting","1855","BMWI-2",,"e1*2007/46*1287*01","2Z21","6A040000","0","0.05","280","Ja","Nee",,"Nee","0","0","0.00","2023","Logisch","00","Nee",,,"2014-10-31T00:00:00.000","2014-10-31T00:00:00.000",,"0",,,,,,,,,,,,,,,,,,,"A",,,,,,,"https://opendata.rdw.nl/resource/3huj-srit.json","https://opendata.rdw.nl/resource/8ys7-d773.json","https://opendata.rdw.nl/resource/vezc-m2t6.json","https://opendata.rdw.nl/resource/jhie-znh9.json","https://opendata.rdw.nl/resource/kmfi-hrps.json"
"1XVR78","Personenauto","BMW I","I8","20231118",,,"coupe","4","GRIJS","Niet geregistreerd","3","1499","1460","1855","1560",,,"20141113","20141113","Geen verstrekking in Open Data","149362","Nee",,,,,,,"2","4","0","0",,"469","0","M1",,,"r. by voorzitting","1855","BMWI-2",,"e1*2007/46*1287*01","2Z21","6A040000","0","0.05","280","Ja","Nee",,"Nee","0","0","0.00","2023","Logisch","00","Nee","2023-11-18T00:00:00.000",,"2014-11-13T00:00:00.000","2014-11-13T00:00:00.000",,"0",,,,,,,,,,,,,,,,,,,"A",,,,,,,"https://opendata.rdw.nl/resource/3huj-srit.json","https://opendata.rdw.nl/resource/8ys7-d773.json","https://opendata.rdw.nl/resource/vezc-m2t6.json","https://opendata.rdw.nl/resource/jhie-znh9.json","https://opendata.rdw.nl/resource/kmfi-hrps.json"
"3XNV26","Personenauto","BMW I","I8","20231122",,,"coupe","4","GRIJS","Niet geregistreerd","3","1499","1460","1855","1560",,,"20141010","20141010","Geen verstrekking in Open Data","148999","Nee",,,,,,,"2","4","0","0",,"469","0","M1",,,"r. by voorzitting","1855","BMWI-2",,"e1*2007/46*1287*01","2Z21","6A040000","0","0.05","280","Ja","Nee",,"Nee","0","0","0.00","2023","Niet geregistreerd","NG","Nee","2023-11-22T00:00:00.000",,"2014-10-10T00:00:00.000","2014-10-10T00:00:00.000",,"0",,,,,,,,,,,,,,,,,,,"A",,,,,,,"https://opendata.rdw.nl/resource/3huj-srit.json","https://opendata.rdw.nl/resource/8ys7-d773.json","https://opendata.rdw.nl/resource/vezc-m2t6.json","https://opendata.rdw.nl/resource/jhie-znh9.json","https://opendata.rdw.nl/resource/kmfi-hrps.json"
"4XLL83","Personenauto","BMW I","I8","20230916",,,"coupe","4","BLAUW","Niet geregistreerd","3","1499","1460","1855","1560",,,"20140916","20140916","Geen verstrekking in Open Data","150937","Nee",,,,,,,"2","4","0","0",,"469","0","M1",,,"r. by voorzitting","1855","BMWI-2",,"e1*2007/46*1287*01","2Z21","6A040000","0","0.05","280","Ja","Nee",,"Nee","0","0","0.00","2023","Logisch","00","Nee","2023-09-16T00:00:00.000",,"2014-09-16T00:00:00.000","2014-09-16T00:00:00.000",,"0",,,,,,,,,,,,,,,,,,,"A",,,,,,,"https://opendata.rdw.nl/resource/3huj-srit.json","https://opendata.rdw.nl/resource/8ys7-d773.json","https://opendata.rdw.nl/resource/vezc-m2t6.json","https://opendata.rdw.nl/resource/jhie-znh9.json","https://opendata.rdw.nl/resource/kmfi-hrps.json"
"8XSN76","Personenauto","BMW I","I8","20240330","20230331",,"coupe","4","GRIJS","Niet geregistreerd","3","1499","1460","1855","1560",,,"20141024","20141024","Geen verstrekking in Open Data","137531","Nee","250",,,,,,"2","4","0","0",,"469","194","M1",,,,"1855","BMWI-2",,"e1*2007/46*1287*01","2Z21","6A040000","0","0.05","280","Ja","Nee",,"Nee","0","0","0.00","2023","Geen oordeel","05","Nee","2024-03-30T00:00:00.000","2023-03-31T00:00:00.000","2014-10-24T00:00:00.000","2014-10-24T00:00:00.000",,,,,,,,,,,"129",,,,,,,,,,"A","20230127","2023-01-27T00:00:00.000",,,,,"https://opendata.rdw.nl/resource/3huj-srit.json","https://opendata.rdw.nl/resource/8ys7-d773.json","https://opendata.rdw.nl/resource/vezc-m2t6.json","https://opendata.rdw.nl/resource/jhie-znh9.json","https://opendata.rdw.nl/resource/kmfi-hrps.json"
"8ZHL50","Personenauto","BMW I","I8",,,,"coupe","4","GRIJS","Niet geregistreerd","3","1499","1460","1855","1560",,,"20150107","20150107","Geen verstrekking in Open Data","149718","Nee",,,,,,,"2","4","0","0",,"469","0","M1",,,"r. by voorzitting","1855","BMWI-2",,"e1*2007/46*1287*01","2Z21","6A040000","0","0.05","280","Ja","Nee",,"Nee","0","0","0.00","2023","Logisch","00","Nee",,,"2015-01-07T00:00:00.000","2015-01-07T00:00:00.000",,"0",,,,,,,,,,,,,,,,,,,"A",,,,,,,"https://opendata.rdw.nl/resource/3huj-srit.json","https://opendata.rdw.nl/resource/8ys7-d773.json","https://opendata.rdw.nl/resource/vezc-m2t6.json","https://opendata.rdw.nl/resource/jhie-znh9.json","https://opendata.rdw.nl/resource/kmfi-hrps.json"
"GG542N","Personenauto","BMW I","I8","20230527",,"469","coupe","4","GRIJS","Niet geregistreerd","3","1499","1460","1855","1560",,,"20150518","20150518","Geen verstrekking in Open Data","150685","Nee",,,,,,,"2","4","0","0",,"469","0","M1",,,"r. by voorzitting","1855","BMWI-2",,"e1*2007/46*1287*01","2Z21","6A040000","0","0.05","280","Ja","Nee",,"Nee","0","0","0.00","2022","Logisch","00","Nee","2023-05-27T00:00:00.000",,"2015-05-18T00:00:00.000","2015-05-18T00:00:00.000",,,,,,,,,,,,,,,,,,,,,"A",,,,,,,"https://opendata.rdw.nl/resource/3huj-srit.json","https://opendata.rdw.nl/resource/8ys7-d773.json","https://opendata.rdw.nl/resource/vezc-m2t6.json","https://opendata.rdw.nl/resource/jhie-znh9.json","https://opendata.rdw.nl/resource/kmfi-hrps.json"
"GX282L","Personenauto","BMW I","I8","20240628",,"469","coupe","4","GRIJS","Niet geregistreerd","3","1499","1460","1855","1560",,,"20150922","20150922","Geen verstrekking in Open Data","150801","Nee",,,,,,,"2","4","0","0",,"469","0","M1",,,"r. by voorzitting","1855","BMWI-2",,"e1*2007/46*1287*01","2Z21","6A040000","0","0.05","280","Ja","Nee",,"Nee","0","0","0.00","2023","Logisch","00","Nee","2024-06-28T00:00:00.000",,"2015-09-22T00:00:00.000","2015-09-22T00:00:00.000",,,,,,,,,,,,,,,,,,,,,"A",,,,,,,"https://opendata.rdw.nl/resource/3huj-srit.json","https://opendata.rdw.nl/resource/8ys7-d773.json","https://opendata.rdw.nl/resource/vezc-m2t6.json","https://opendata.rdw.nl/resource/jhie-znh9.json","https://opendata.rdw.nl/resource/kmfi-hrps.json"
"HF963P","Personenauto","BMW I","I8","20240607",,"469","coupe","4","GRIJS","ZWART","3","1499","1460","1855","1560",,,"20151023","20151023","Geen verstrekking in Open Data","148920","Nee",,,,,,,"2","4","0","0",,"469","194","M1",,,"onder r. voorzitting","1855","BMWI-2",,"e1*2007/46*1287*01","2Z21","6A040000","0","0.11","280","Ja","Nee",,"Nee","0","0","0.00","2023","Logisch","00","Nee","2024-06-07T00:00:00.000",,"2015-10-23T00:00:00.000","2015-10-23T00:00:00.000",,,,,,,,,,,"129",,,,,,,,,,"A",,,,,,,"https://opendata.rdw.nl/resource/3huj-srit.json","https://opendata.rdw.nl/resource/8ys7-d773.json","https://opendata.rdw.nl/resource/vezc-m2t6.json","https://opendata.rdw.nl/resource/jhie-znh9.json","https://opendata.rdw.nl/resource/kmfi-hrps.json"
"HP223V","Personenauto","BMW I","I8","20250201","20200307","469","coupe","4","WIT","ZWART","3","1499","1460","1855","1560",,,"20151222","20151222","Geen verstrekking in Open Data","147700","Nee",,,,,,,"2","4","0","0",,"469","194","M1",,,"onder r. voorzitting","1855","BMWI-2",,"e1*2007/46*1287*01","2Z21","6A040000","0","0.11","280","Ja","Nee",,"Nee","0","0","0.00","2024","Logisch","00","Nee","2025-02-01T00:00:00.000","2020-03-07T00:00:00.000","2015-12-22T00:00:00.000","2015-12-22T00:00:00.000",,,,,,,,,,,"129",,,,,,,,,,"A",,,,,,,"https://opendata.rdw.nl/resource/3huj-srit.json","https://opendata.rdw.nl/resource/8ys7-d773.json","https://opendata.rdw.nl/resource/vezc-m2t6.json","https://opendata.rdw.nl/resource/jhie-znh9.json","https://opendata.rdw.nl/resource/kmfi-hrps.json"
"JS021X","Personenauto","BMW I","I8","20250216",,"469","coupe","4","GRIJS","ZWART","3","1499","1460","1870","1560",,,"20160613","20160613","Geen verstrekking in Open Data","150311","Nee",,,,,,,"2","4","0","0",,"469","194","M1",,,"onder r. voorzitting","1870","BMWI-2",,"e1*2007/46*1287*02","2Z21","6A040000","0","0.11","280","Ja","Nee",,"Nee","0","0","0.00","2023","Logisch","00","Nee","2025-02-16T00:00:00.000",,"2016-06-13T00:00:00.000","2016-06-13T00:00:00.000",,,,,,,,,,,"129",,,,,,,,,,"A",,,,,,,"https://opendata.rdw.nl/resource/3huj-srit.json","https://opendata.rdw.nl/resource/8ys7-d773.json","https://opendata.rdw.nl/resource/vezc-m2t6.json","https://opendata.rdw.nl/resource/jhie-znh9.json","https://opendata.rdw.nl/resource/kmfi-hrps.json"
"JS464K","Personenauto","BMW I","I8","20240621","20230904","469","coupe","4","GRIJS","ZWART","3","1499","1460","1870","1560",,,"20160606","20160606","Geen verstrekking in Open Data","149976","Ja",,,,,,,"2","4","0","0",,"469","194","M1",,,"onder r. voorzitting","1870","BMWI-2",,"e1*2007/46*1287*02","2Z21","6A040000","0","0.11","280","Ja","Nee",,"Nee","0","0","0.00","2024","Logisch","00","Nee","2024-06-21T00:00:00.000","2023-09-04T00:00:00.000","2016-06-06T00:00:00.000","2016-06-06T00:00:00.000",,,,,,,,,,,"129",,,,,,,,,,"A",,,,,,,"https://opendata.rdw.nl/resource/3huj-srit.json","https://opendata.rdw.nl/resource/8ys7-d773.json","https://opendata.rdw.nl/resource/vezc-m2t6.json","https://opendata.rdw.nl/resource/jhie-znh9.json","https://opendata.rdw.nl/resource/kmfi-hrps.json"
"KD570T","Personenauto","BMW I","I8","20241102",,,"coupe","4","WIT","Niet geregistreerd","3","1499","1460","1855","1560",,,"20140623","20160803","Geen verstrekking in Open Data","148999","Nee",,,,,,,"2","4","0","0",,"469","0","M1",,,"r. by voorzitting","1855","BMWI-2",,"e1*2007/46*1287*00","2Z21","6A040000","0","0.05","280","Ja","Nee",,"Nee","0","0",,"2023","Geen oordeel","05","Nee","2024-11-02T00:00:00.000",,"2014-06-23T00:00:00.000","2016-08-03T00:00:00.000",,,,,,,,,,,,,,,,,,,,,"A",,,,,,,"https://opendata.rdw.nl/resource/3huj-srit.json","https://opendata.rdw.nl/resource/8ys7-d773.json","https://opendata.rdw.nl/resource/vezc-m2t6.json","https://opendata.rdw.nl/resource/jhie-znh9.json","https://opendata.rdw.nl/resource/kmfi-hrps.json"
"KF402F","Personenauto","BMW I","I8",,,"469","coupe","4","WIT","ZWART","3","1499","1460","1870","1560",,,"20160812","20160812","Geen verstrekking in Open Data","152459","Nee",,,,,,,"2","4","0","0",,"469","194","M1",,,"onder r. voorzitting","1870","BMWI-2",,"e1*2007/46*1287*02","2Z21","6A040000","0","0.11","280","Ja","Nee",,"Nee","0","0","0.00","2023","Logisch","00","Nee",,,"2016-08-12T00:00:00.000","2016-08-12T00:00:00.000",,,,,,,,,,,"129",,,,,,,,,,"A",,,,,,,"https://opendata.rdw.nl/resource/3huj-srit.json","https://opendata.rdw.nl/resource/8ys7-d773.json","https://opendata.rdw.nl/resource/vezc-m2t6.json","https://opendata.rdw.nl/resource/jhie-znh9.json","https://opendata.rdw.nl/resource/kmfi-hrps.json"
"N181DS","Personenauto","BMW I","I8",,,"1614","coupe","4","GRIJS","Niet geregistreerd","3","1499","1510","1920","1610",,,"20180518","20210917","Geen verstrekking in Open Data","147394","Nee","250",,,,,,"2","4","0","0",,"469","194","M1",,,,"1920","BMWI-2",,"e1*2007/46*1287*04","2Z41","6AW40000","0","0.05","280","Ja","Nee",,"Nee","0","0","0.00","2023","Geen oordeel","05","Nee",,,"2018-05-18T00:00:00.000","2021-09-17T00:00:00.000",,,,,,,,,,,"129",,,,,,,,,,,,,,,,,"https://opendata.rdw.nl/resource/3huj-srit.json","https://opendata.rdw.nl/resource/8ys7-d773.json","https://opendata.rdw.nl/resource/vezc-m2t6.json","https://opendata.rdw.nl/resource/jhie-znh9.json","https://opendata.rdw.nl/resource/kmfi-hrps.json"
"N468RD","Personenauto","BMW I","I8","20251101",,"2586","cabriolet","2","GRIJS","ZWART","3","1499","1570","1900","1670",,,"20191031","20211203","Geen verstrekking in Open Data","180611","Nee","250",,,,,,"2","4","0","0",,"469","194","M1",,,,"1900","BMWI-2",,"e1*2007/46*1287*07","2Z61","DAW200T0","0","0.04","280","Ja","Nee",,"Nee","0","0","0.00","2024","Geen oordeel","05","Nee","2025-11-01T00:00:00.000",,"2019-10-31T00:00:00.000","2021-12-03T00:00:00.000",,,,,,,,,,,"129",,,,,,,,,,,"20211129","2021-11-29T00:00:00.000",,,,,"https://opendata.rdw.nl/resource/3huj-srit.json","https://opendata.rdw.nl/resource/8ys7-d773.json","https://opendata.rdw.nl/resource/vezc-m2t6.json","https://opendata.rdw.nl/resource/jhie-znh9.json","https://opendata.rdw.nl/resource/kmfi-hrps.json"
"N637LJ","Personenauto","BMW I","I8","20241118","20240228",,"coupe","4","GRIJS","ZWART","3","1499","1460","1855","1560",,,"20141202","20211111","Geen verstrekking in Open Data","148999","Ja","250",,,,,,"2","4","0","0",,"469","194","M1",,,"r. by voorzitting","1855","BMWI-2",,"e1*2007/46*1287*01","2Z21","6A040000","0","0.05","280","Ja","Nee",,"Nee","0","0","0.00","2024","Geen oordeel","05","Nee","2024-11-18T00:00:00.000","2024-02-28T00:00:00.000","2014-12-02T00:00:00.000","2021-11-11T00:00:00.000",,,,,,,,,,,"129",,,,,,,,,,,"20211109","2021-11-09T00:00:00.000",,,,,"https://opendata.rdw.nl/resource/3huj-srit.json","https://opendata.rdw.nl/resource/8ys7-d773.json","https://opendata.rdw.nl/resource/vezc-m2t6.json","https://opendata.rdw.nl/resource/jhie-znh9.json","https://opendata.rdw.nl/resource/kmfi-hrps.json"
"N874DZ","Personenauto","BMW I","I8",,,"1613","coupe","4","GRIJS","ZWART","3","1499","1510","1920","1610",,,"20180329","20210921","Geen verstrekking in Open Data","154055","Nee","250",,,,,,"2","4","0","0",,"469","194","M1",,,,"1920","BMWI-2",,"e1*2007/46*1287*04","2Z41","6AW40000","0","0.05","280","Ja","Nee",,"Nee","0","0","0.00","2023","Geen oordeel","05","Nee",,,"2018-03-29T00:00:00.000","2021-09-21T00:00:00.000",,,,,,,,,,,"129",,,,,,,,,,,,,,,,,"https://opendata.rdw.nl/resource/3huj-srit.json","https://opendata.rdw.nl/resource/8ys7-d773.json","https://opendata.rdw.nl/resource/vezc-m2t6.json","https://opendata.rdw.nl/resource/jhie-znh9.json","https://opendata.rdw.nl/resource/kmfi-hrps.json"
"PJ345H","Personenauto","BMW I","I8","20240106",,"364","coupe","4","GRIJS","ZWART","3","1499","1460","1855","1560",,,"20151208","20170704","Geen verstrekking in Open Data","161122","Nee",,,,,,,"2","4","0","0",,"469","0","M1",,,"r. by voorzitting","1855","BMWI-2",,"e1*2007/46*1287*01","2Z21","6A040000","0","0.05","280","Ja","Nee",,"Nee","0","0","0.00","2023","Onlogisch","04","Nee","2024-01-06T00:00:00.000",,"2015-12-08T00:00:00.000","2017-07-04T00:00:00.000",,,,,,,,,,,,,,,,,,,,,"A",,,,,,,"https://opendata.rdw.nl/resource/3huj-srit.json","https://opendata.rdw.nl/resource/8ys7-d773.json","https://opendata.rdw.nl/resource/vezc-m2t6.json","https://opendata.rdw.nl/resource/jhie-znh9.json","https://opendata.rdw.nl/resource/kmfi-hrps.json"
"RT439T","Personenauto","BMW I","I8","20240417",,"469","coupe","4","WIT","ZWART","3","1499","1460","1855","1560",,,"20150330","20180222","Geen verstrekking in Open Data","139717","Nee",,,,,,,"2","4","0","0",,"469","0","M1",,,"r. by voorzitting","1855","BMWI-2",,"e1*2007/46*1287*01","2Z21","6A040000","0","0.00","280","Ja","Nee",,"Nee","0","0","0.00","2023","Geen oordeel","05","Nee","2024-04-17T00:00:00.000",,"2015-03-30T00:00:00.000","2018-02-22T00:00:00.000",,,,,,,,,,,,,,,,,,,,,"A",,,,,,,"https://opendata.rdw.nl/resource/3huj-srit.json","https://opendata.rdw.nl/resource/8ys7-d773.json","https://opendata.rdw.nl/resource/vezc-m2t6.json","https://opendata.rdw.nl/resource/jhie-znh9.json","https://opendata.rdw.nl/resource/kmfi-hrps.json"
"SX448K","Personenauto","BMW I","I8",,,"1962","cabriolet","2","GRIJS","ZWART","3","1499","1570","1900","1670",,,"20180614","20180614","Geen verstrekking in Open Data","175071","Nee",,,,,,,"2","4","0","0",,"469","0","M1",,,,"1900","BMWI-2",,"e1*2007/46*1287*04","2Z61","6AW20000","0","0.10","280","Ja","Nee",,"Nee","0","0","0.00","2022","Logisch","00","Nee",,,"2018-06-14T00:00:00.000","2018-06-14T00:00:00.000",,,,,,,,,,,,,,,,,,,,,,,,,,,,"https://opendata.rdw.nl/resource/3huj-srit.json","https://opendata.rdw.nl/resource/8ys7-d773.json","https://opendata.rdw.nl/resource/vezc-m2t6.json","https://opendata.rdw.nl/resource/jhie-znh9.json","https://opendata.rdw.nl/resource/kmfi-hrps.json"
"TJ242S","Personenauto","BMW I","I8","20240906",,"1962","cabriolet","2","GRIJS","Niet geregistreerd","3","1499","1570","1900","1670",,,"20180817","20180817","Geen verstrekking in Open Data","186777","Nee",,,,,,,"2","4","0","0",,"469","194","M1",,,,"1900","BMWI-2",,"e1*2007/46*1287*04","2Z61","6AW20000","0","0.10","280","Ja","Nee",,"Nee","0","0","0.00","2023","Logisch","00","Nee","2024-09-06T00:00:00.000",,"2018-08-17T00:00:00.000","2018-08-17T00:00:00.000",,,,,,,,,,,"129",,,,,,,,,,,,,,,,,"https://opendata.rdw.nl/resource/3huj-srit.json","https://opendata.rdw.nl/resource/8ys7-d773.json","https://opendata.rdw.nl/resource/vezc-m2t6.json","https://opendata.rdw.nl/resource/jhie-znh9.json","https://opendata.rdw.nl/resource/kmfi-hrps.json"
"XX031D","Personenauto","BMW I","I8","20250410",,"2618","cabriolet","2","GRIJS","ZWART","3","1499","1570","1900","1670",,,"20190410","20190410","Geen verstrekking in Open Data","180289","Nee",,,,,,,"2","4","0","0",,"469","194","M1",,,,"1900","BMWI-2",,"e1*2007/46*1287*04","2Z61","6AW20000","0","0.10","280","Ja","Nee",,"Nee","0","0","0.00","2023","Logisch","00","Nee","2025-04-10T00:00:00.000",,"2019-04-10T00:00:00.000","2019-04-10T00:00:00.000",,,,,,,,,,,"129",,,,,,,,,,,,,,,,,"https://opendata.rdw.nl/resource/3huj-srit.json","https://opendata.rdw.nl/resource/8ys7-d773.json","https://opendata.rdw.nl/resource/vezc-m2t6.json","https://opendata.rdw.nl/resource/jhie-znh9.json","https://opendata.rdw.nl/resource/kmfi-hrps.json"
"ZB152X","Personenauto","BMW I","I8","20240830",,"2618","cabriolet","2","GRIJS","Niet geregistreerd","3","1499","1570","1900","1670",,,"20190429","20190429","Geen verstrekking in Open Data","182374","Nee",,,,,,,"2","4","0","0",,"469","0","M1",,,,"1900","BMWI-2",,"e1*2007/46*1287*04","2Z61","6AW20000","0","0.10","280","Ja","Nee",,"Nee","0","0","0.00","2022","Logisch","00","Nee","2024-08-30T00:00:00.000",,"2019-04-29T00:00:00.000","2019-04-29T00:00:00.000",,,,,,,,,,,,,,,,,,,,,,,,,,,,"https://opendata.rdw.nl/resource/3huj-srit.json","https://opendata.rdw.nl/resource/8ys7-d773.json","https://opendata.rdw.nl/resource/vezc-m2t6.json","https://opendata.rdw.nl/resource/jhie-znh9.json","https://opendata.rdw.nl/resource/kmfi-hrps.json"
"ZB250P","Personenauto","BMW I","I8",,,"2618","cabriolet","2","GRIJS","ZWART","3","1499","1570","1900","1670",,,"20190424","20190424","Geen verstrekking in Open Data","176913","Nee",,,,,,,"2","4","0","0",,"469","0","M1",,,,"1900","BMWI-2",,"e1*2007/46*1287*04","2Z61","6AW20000","0","0.10","280","Ja","Nee",,"Nee","0","0","0.00","2022","Logisch","00","Nee",,,"2019-04-24T00:00:00.000","2019-04-24T00:00:00.000",,,,,,,,,,,,,,,,,,,,,,,,,,,,"https://opendata.rdw.nl/resource/3huj-srit.json","https://opendata.rdw.nl/resource/8ys7-d773.json","https://opendata.rdw.nl/resource/vezc-m2t6.json","https://opendata.rdw.nl/resource/jhie-znh9.json","https://opendata.rdw.nl/resource/kmfi-hrps.json"
"ZB253P","Personenauto","BMW I","I8","20240816",,"2618","cabriolet","2","GRIJS","ZWART","3","1499","1570","1900","1670",,,"20190424","20190424","Geen verstrekking in Open Data","176913","Nee",,,,,,,"2","4","0","0",,"469","0","M1",,,,"1900","BMWI-2",,"e1*2007/46*1287*04","2Z61","6AW20000","0","0.10","280","Ja","Nee",,"Nee","0","0","0.00","2022","Logisch","00","Nee","2024-08-16T00:00:00.000",,"2019-04-24T00:00:00.000","2019-04-24T00:00:00.000",,,,,,,,,,,,,,,,,,,,,,,,,,,,"https://opendata.rdw.nl/resource/3huj-srit.json","https://opendata.rdw.nl/resource/8ys7-d773.json","https://opendata.rdw.nl/resource/vezc-m2t6.json","https://opendata.rdw.nl/resource/jhie-znh9.json","https://opendata.rdw.nl/resource/kmfi-hrps.json"
