"kenteken","voertuigsoort","merk","handelsbenaming","vervaldatum_apk","datum_tenaamstelling","bruto_bpm","inrichting","aantal_zitplaatsen","eerste_kleur","tweede_kleur","aantal_cilinders","cilinderinhoud","massa_ledig_voertuig","toegestane_maximum_massa_voertuig","massa_rijklaar","maximum_massa_trekken_ongeremd","maximum_trekken_massa_geremd","datum_eerste_toelating","datum_eerste_tenaamstelling_in_nederland","wacht_op_keuren","catalogusprijs","wam_verzekerd","maximale_constructiesnelheid","laadvermogen","oplegger_geremd","aanhangwagen_autonoom_geremd","aanhangwagen_middenas_geremd","aantal_staanplaatsen","aantal_deuren","aantal_wielen","afstand_hart_koppeling_tot_achterzijde_voertuig","afstand_voorzijde_voertuig_tot_hart_koppeling","afwijkende_maximum_snelheid","lengte","breedte","europese_voertuigcategorie","europese_voertuigcategorie_toevoeging","europese_uitvoeringcategorie_toevoeging","plaats_chassisnummer","technische_max_massa_voertuig","type","type_gasinstallatie","typegoedkeuringsnummer","variant","uitvoering","volgnummer_wijziging_eu_typegoedkeuring","vermogen_massarijklaar","wielbasis","export_indicator","openstaande_terugroepactie_indicator","vervaldatum_tachograaf","taxi_indicator","maximum_massa_samenstelling","aantal_rolstoelplaatsen","maximum_ondersteunende_snelheid","jaar_laatste_registratie_tellerstand","tellerstandoordeel","code_toelichting_tellerstandoordeel","tenaamstellen_mogelijk","vervaldatum_apk_dt","datum_tenaamstelling_dt","datum_eerste_toelating_dt","datum_eerste_tenaamstelling_in_nederland_dt","vervaldatum_tachograaf_dt","maximum_last_onder_de_vooras_sen_tezamen_koppeling","type_remsysteem_voertuig_code","rupsonderstelconfiguratiecode","wielbasis_voertuig_minimum","wielbasis_voertuig_maximum","lengte_voertuig_minimum","lengte_voertuig_maximum","breedte_voertuig_minimum","breedte_voertuig_maximum","hoogte_voertuig","hoogte_voertuig_minimum","hoogte_voertuig_maximum","massa_bedrijfsklaar_minimaal","massa_bedrijfsklaar_maximaal","technisch_toelaatbaar_massa_koppelpunt","maximum_massa_technisch_maximaal","maximum_massa_technisch_minimaal","subcategorie_nederland","verticale_belasting_koppelpunt_getrokken_voertuig","zuinigheidsclassificatie","registratie_datum_goedkeuring_afschrijvingsmoment_bpm","registratie_datum_goedkeuring_afschrijvingsmoment_bpm_dt","gem_lading_wrde","aerodyn_voorz","massa_alt_aandr","verl_cab_ind","api_gekentekende_voertuigen_assen","api_gekentekende_voertuigen_brandstof","api_gekentekende_voertuigen_carrosserie","api_gekentekende_voertuigen_carrosserie_specifiek","api_gekentekende_voertuigen_voertuigklasse"
"1ZGG87","Personenauto","BMW","420D","20231024",,"205","sedan","5","ZWART","Niet geregistreerd","4","1995","1500","2085","1600","745","1600","20150106","20150106","Geen verstrekking in Open Data","66733","Nee","231",,,,,,"4","4","0","0",,"464","0","M1",,,"r. schroefveerkoker","2085","3C",,"e1*2007/46*0316*11","4B51","6A250000","0","0.08","281","Ja","Ja",,"Nee","3760","0",,"2022","Geen oordeel","05","Nee","2023-10-24T00:00:00.000",,"2015-01-06T00:00:00.000","2015-01-06T00:00:00.000",,,,,,,,,,,,,,,,,,,,,"D","20220711","2022-07-11T00:00:00.000",,,,,"https://opendata.rdw.nl/resource/3huj-srit.json","https://opendata.rdw.nl/resource/8ys7-d773.json","https://opendata.rdw.nl/resource/vezc-m2t6.json","https://opendata.rdw.nl/resource/jhie-znh9.json","https://opendata.rdw.nl/resource/kmfi-hrps.json"
"1ZLJ57","Personenauto","BMW","420D","20230831",,"8810","sedan","5","ZWART","Niet geregistreerd","4","1995","1500","2085","1600","745","1600","20150123","20150123","Geen verstrekking in Open Data","87725","Nee","231",,,,,,"4","4","0","0",,"464","0","M1",,,"r. schroefveerkoker","2085","3C",,"e1*2007/46*0316*11","4B51","6A250000","0","0.08","281","Ja","Ja",,"Nee","3760","0",,"2023","Geen oordeel","05","Nee","2023-08-31T00:00:00.000",,"2015-01-23T00:00:00.000","2015-01-23T00:00:00.000",,,,,,,,,,,,,,,,,,,,,"D",,,,,,,"https://opendata.rdw.nl/resource/3huj-srit.json","https://opendata.rdw.nl/resource/8ys7-d773.json","https://opendata.rdw.nl/resource/vezc-m2t6.json","https://opendata.rdw.nl/resource/jhie-znh9.json","https://opendata.rdw.nl/resource/kmfi-hrps.json"
"2ZGF91","Personenauto","BMW","420D","20230618",,"7520","sedan","5","BRUIN","Niet geregistreerd","4","1995","1500","2085","1600","745","1600","20150113","20150113","Geen verstrekking in Open Data","59592","Nee",,,,,,,"4","4","0","0",,"464","0","M1",,,"r. schroefveerkoker","2085","3C",,"e1*2007/46*0316*11","4B51","6A150000","0","0.08","281","Ja","Nee",,"Nee","3760","0",,"2023","Logisch","00","Nee","2023-06-18T00:00:00.000",,"2015-01-13T00:00:00.000","2015-01-13T00:00:00.000",,,,,,,,,,,,,,,,,,,,,"C",,,,,,,"https://opendata.rdw.nl/resource/3huj-srit.json","https://opendata.rdw.nl/resource/8ys7-d773.json","https://opendata.rdw.nl/resource/vezc-m2t6.json","https://opendata.rdw.nl/resource/jhie-znh9.json","https://opendata.rdw.nl/resource/kmfi-hrps.json"
"2ZTV26","Personenauto","BMW","420D","20230403",,"5419","sedan","5","GRIJS","Niet geregistreerd","4","1995","1515","2100","1615","745","1600","20150403","20150403","Geen verstrekking in Open Data","63035","Nee",,,,,,,"4","4","0","0",,"464","0","M1",,,"r. schroefveerkoker","2100","3C",,"e1*2007/46*0316*13","4E91","6A150000","0","0.09","281","Ja","Ja",,"Nee","3775","0",,"2022","Logisch","00","Nee","2023-04-03T00:00:00.000",,"2015-04-03T00:00:00.000","2015-04-03T00:00:00.000",,,,,,,,,,,,,,,,,,,,,"B",,,,,,,"https://opendata.rdw.nl/resource/3huj-srit.json","https://opendata.rdw.nl/resource/8ys7-d773.json","https://opendata.rdw.nl/resource/vezc-m2t6.json","https://opendata.rdw.nl/resource/jhie-znh9.json","https://opendata.rdw.nl/resource/kmfi-hrps.json"
"4XVH95","Personenauto","BMW","420D","20231007",,"8117","sedan","5","ZWART","Niet geregistreerd","4","1995","1500","2085","1600","745","1600","20141103","20141103","Geen verstrekking in Open Data","72551","Nee",,,,,,,"4","4","0","0",,"464","0","M1",,,"r. schroefveerkoker","2085","3C",,"e1*2007/46*0316*10","4B51","6A250000","0","0.08","281","Ja","Nee",,"Nee","3760","0",,"2022","Logisch","00","Nee","2023-10-07T00:00:00.000",,"2014-11-03T00:00:00.000","2014-11-03T00:00:00.000",,,,,,,,,,,,,,,,,,,,,"D",,,,,,,"https://opendata.rdw.nl/resource/3huj-srit.json","https://opendata.rdw.nl/resource/8ys7-d773.json","https://opendata.rdw.nl/resource/vezc-m2t6.json","https://opendata.rdw.nl/resource/jhie-znh9.json","https://opendata.rdw.nl/resource/kmfi-hrps.json"
"6ZNN96","Personenauto","BMW","420D XDRIVE","20250513","20240222","10197","sedan","5","GRIJS","Niet geregistreerd","4","1995","1575","2160","1675","750","1600","20150206","20150206","Geen verstrekking in Open Data","79386","Ja",,,,,,,"4","4","0","0",,"464","0","M1",,,"r. schroefveerkoker","2160","3C",,"e1*2007/46*0316*10","4B71","6A250000","0","0.08","281","Ja","Nee",,"Nee","3835","0",,"2024","Logisch","00","Nee","2025-05-13T00:00:00.000","2024-02-22T00:00:00.000","2015-02-06T00:00:00.000","2015-02-06T00:00:00.000",,,,,,,,,,,,,,,,,,,,,"D",,,,,,,"https://opendata.rdw.nl/resource/3huj-srit.json","https://opendata.rdw.nl/resource/8ys7-d773.json","https://opendata.rdw.nl/resource/vezc-m2t6.json","https://opendata.rdw.nl/resource/jhie-znh9.json","https://opendata.rdw.nl/resource/kmfi-hrps.json"
"7XKH58","Personenauto","BMW","420D","20240703","20230705","7520","sedan","5","WIT","Niet geregistreerd","4","1995","1500","2085","1600","745","1600","20140904","20140904","Geen verstrekking in Open Data","58659","Nee",,,,,,,"4","4","0","0",,"464","0","M1",,,"r. schroefveerkoker","2085","3C",,"e1*2007/46*0316*11","4B51","6A150000","0","0.08","281","Ja","Nee",,"Nee","3760","0",,"2024","Onlogisch","04","Nee","2024-07-03T00:00:00.000","2023-07-05T00:00:00.000","2014-09-04T00:00:00.000","2014-09-04T00:00:00.000",,,,,,,,,,,,,,,,,,,,,"C",,,,,,,"https://opendata.rdw.nl/resource/3huj-srit.json","https://opendata.rdw.nl/resource/8ys7-d773.json","https://opendata.rdw.nl/resource/vezc-m2t6.json","https://opendata.rdw.nl/resource/jhie-znh9.json","https://opendata.rdw.nl/resource/kmfi-hrps.json"
"7XLP54","Personenauto","BMW","420D","20230611",,"8117","sedan","5","GRIJS","Niet geregistreerd","4","1995","1500","2085","1600","745","1600","20140913","20140913","Geen verstrekking in Open Data","74941","Nee",,,,,,,"4","4","0","0",,"464","0","M1",,,"r. schroefveerkoker","2085","3C",,"e1*2007/46*0316*11","4B51","6A250700","0","0.08","281","Ja","Ja",,"Nee","3760","0",,"2022","Logisch","00","Nee","2023-06-11T00:00:00.000",,"2014-09-13T00:00:00.000","2014-09-13T00:00:00.000",,,,,,,,,,,,,,,,,,,,,"D",,,,,,,"https://opendata.rdw.nl/resource/3huj-srit.json","https://opendata.rdw.nl/resource/8ys7-d773.json","https://opendata.rdw.nl/resource/vezc-m2t6.json","https://opendata.rdw.nl/resource/jhie-znh9.json","https://opendata.rdw.nl/resource/kmfi-hrps.json"
"7XPR22","Personenauto","BMW","420D","20231112",,"8117","sedan","5","ZWART","Niet geregistreerd","4","1995","1500","2085","1600","745","1600","20141003","20141003","Geen verstrekking in Open Data","70728","Nee",,,,,,,"4","4","0","0",,"464","0","M1",,,"r. schroefveerkoker","2085","3C",,"e1*2007/46*0316*11","4B51","6A250000","0","0.08","281","Ja","Ja",,"Nee","3760","0",,"2023","Logisch","00","Nee","2023-11-12T00:00:00.000",,"2014-10-03T00:00:00.000","2014-10-03T00:00:00.000",,,,,,,,,,,,,,,,,,,,,"D",,,,,,,"https://opendata.rdw.nl/resource/3huj-srit.json","https://opendata.rdw.nl/resource/8ys7-d773.json","https://opendata.rdw.nl/resource/vezc-m2t6.json","https://opendata.rdw.nl/resource/jhie-znh9.json","https://opendata.rdw.nl/resource/kmfi-hrps.json"
"7ZLX86","Personenauto","BMW","420D XDRIVE","20240520",,"7014","sedan","5","ZWART","Niet geregistreerd","4","1995","1575","2160","1675","750","1600","20140912","20150401","Geen verstrekking in Open Data","74102","Nee",,,,,,,"4","4","0","0",,"464","0","M1",,,"r. schroefveerkoker","2160","3C",,"e1*2007/46*0316*11","4B71","6A250000","0","0.08","281","Ja","Nee",,"Nee","3835","0",,"2024","Geen oordeel","05","Nee","2024-05-20T00:00:00.000",,"2014-09-12T00:00:00.000","2015-04-01T00:00:00.000",,,,,,,,,,,,,,,,,,,,,"D",,,,,,,"https://opendata.rdw.nl/resource/3huj-srit.json","https://opendata.rdw.nl/resource/8ys7-d773.json","https://opendata.rdw.nl/resource/vezc-m2t6.json","https://opendata.rdw.nl/resource/jhie-znh9.json","https://opendata.rdw.nl/resource/kmfi-hrps.json"
"9XLR53","Personenauto","BMW","420D","20240926",,"8117","sedan","5","GRIJS","Niet geregistreerd","4","1995","1500","2085","1600","745","1600","20140926","20140926","Geen verstrekking in Open Data","58173","Nee",,,,,,,"4","4","0","0",,"464","0","M1",,,"r. schroefveerkoker","2085","3C",,"e1*2007/46*0316*11","4B51","6A250000","0","0.08","281","Ja","Ja",,"Nee","3760","0",,"2023","Logisch","00","Nee","2024-09-26T00:00:00.000",,"2014-09-26T00:00:00.000","2014-09-26T00:00:00.000",,,,,,,,,,,,,,,,,,,,,"D",,,,,,,"https://opendata.rdw.nl/resource/3huj-srit.json","https://opendata.rdw.nl/resource/8ys7-d773.json","https://opendata.rdw.nl/resource/vezc-m2t6.json","https://opendata.rdw.nl/resource/jhie-znh9.json","https://opendata.rdw.nl/resource/kmfi-hrps.json"
"G474SF","Personenauto","BMW","420D","20231128",,"10434","sedan","5","WIT","Niet geregistreerd","4","1995","1575","2140","1675","745","1600","20191128","20191128","Geen verstrekking in Open Data","61494","Nee","231",,,,,,"4","4","0","0",,"464","183","M1",,,,"2140","3C",,"e1*2007/46*0316*23","4K31","DAW500K0","0","0.08","281","Ja","Nee",,"Nee","3740","0","0.00","2023","Logisch","00","Nee","2023-11-28T00:00:00.000",,"2019-11-28T00:00:00.000","2019-11-28T00:00:00.000",,,,,,,,,,,"139",,,,,,,,,,,,,,,,,"https://opendata.rdw.nl/resource/3huj-srit.json","https://opendata.rdw.nl/resource/8ys7-d773.json","https://opendata.rdw.nl/resource/vezc-m2t6.json","https://opendata.rdw.nl/resource/jhie-znh9.json","https://opendata.rdw.nl/resource/kmfi-hrps.json"
"G484ZK","Personenauto","BMW","420D XDRIVE","20230816",,"6038","sedan","5","ZWART","Niet geregistreerd","4","1995","1590","2175","1690","750","1600","20170816","20191220","Geen verstrekking in Open Data","70890","Nee","230",,,,,,"4","4","0","0",,"464","183","M1",,,,"2175","3C",,"e1*2007/46*0316*16","4F11","6A250000","0","0.08","281","Ja","Nee",,"Nee","3850","0","0.00","2023","Geen oordeel","05","Nee","2023-08-16T00:00:00.000",,"2017-08-16T00:00:00.000","2019-12-20T00:00:00.000",,,,,,,,,,,"140",,,,,,,,,,"E",,,,,,,"https://opendata.rdw.nl/resource/3huj-srit.json","https://opendata.rdw.nl/resource/8ys7-d773.json","https://opendata.rdw.nl/resource/vezc-m2t6.json","https://opendata.rdw.nl/resource/jhie-znh9.json","https://opendata.rdw.nl/resource/kmfi-hrps.json"
"G768SN","Personenauto","BMW","420D","20241129",,"10434","sedan","5","ZWART","Niet geregistreerd","4","1995","1575","2140","1675","745","1600","20191129","20191129","Geen verstrekking in Open Data","61176","Nee","231",,,,,,"4","4","0","0",,"464","183","M1",,,,"2140","3C",,"e1*2007/46*0316*23","4K31","DAW500K0","0","0.08","281","Ja","Nee",,"Nee","3740","0","0.00","2024","Logisch","00","Nee","2024-11-29T00:00:00.000",,"2019-11-29T00:00:00.000","2019-11-29T00:00:00.000",,,,,,,,,,,"139",,,,,,,,,,,,,,,,,"https://opendata.rdw.nl/resource/3huj-srit.json","https://opendata.rdw.nl/resource/8ys7-d773.json","https://opendata.rdw.nl/resource/vezc-m2t6.json","https://opendata.rdw.nl/resource/jhie-znh9.json","https://opendata.rdw.nl/resource/kmfi-hrps.json"
"GD014D","Personenauto","BMW","420D","20240112",,"5419","sedan","5","WIT","Niet geregistreerd","4","1995","1515","2100","1615","745","1600","20150420","20150420","Geen verstrekking in Open Data","49782","Nee",,,,,,,"4","4","0","0",,"464","0","M1",,,"r. schroefveerkoker","2100","3C",,"e1*2007/46*0316*13","4E91","6A150000","0","0.09","281","Ja","Nee",,"Nee","3775","0",,"2023","Logisch","00","Nee","2024-01-12T00:00:00.000",,"2015-04-20T00:00:00.000","2015-04-20T00:00:00.000",,,,,,,,,,,,,,,,,,,,,"B",,,,,,,"https://opendata.rdw.nl/resource/3huj-srit.json","https://opendata.rdw.nl/resource/8ys7-d773.json","https://opendata.rdw.nl/resource/vezc-m2t6.json","https://opendata.rdw.nl/resource/jhie-znh9.json","https://opendata.rdw.nl/resource/kmfi-hrps.json"
"GD020D","Personenauto","BMW","420D","20241204","20191129","5419","sedan","5","ZWART","Niet geregistreerd","4","1995","1515","2100","1615","745","1600","20150416","20150416","Geen verstrekking in Open Data","54864","Nee",,,,,,,"4","4","0","0",,"464","0","M1",,,"r. schroefveerkoker","2100","3C",,"e1*2007/46*0316*13","4E91","6A150000","0","0.09","281","Ja","Ja",,"Nee","3775","0",,"2024","Onlogisch","04","Nee","2024-12-04T00:00:00.000","2019-11-29T00:00:00.000","2015-04-16T00:00:00.000","2015-04-16T00:00:00.000",,,,,,,,,,,,,,,,,,,,,"B",,,,,,,"https://opendata.rdw.nl/resource/3huj-srit.json","https://opendata.rdw.nl/resource/8ys7-d773.json","https://opendata.rdw.nl/resource/vezc-m2t6.json","https://opendata.rdw.nl/resource/jhie-znh9.json","https://opendata.rdw.nl/resource/kmfi-hrps.json"
"GD301Z","Personenauto","BMW","420D","20231007",,"5419","sedan","5","ZWART","Niet geregistreerd","4","1995","1515","2100","1615","745","1600","20150430","20150430","Geen verstrekking in Open Data","59582","Nee",,,,,,,"4","4","0","0",,"464","0","M1",,,"r. schroefveerkoker","2100","3C",,"e1*2007/46*0316*13","4E91","6A150000","0","0.09","281","Ja","Nee",,"Nee","3775","0",,"2023","Logisch","00","Nee","2023-10-07T00:00:00.000",,"2015-04-30T00:00:00.000","2015-04-30T00:00:00.000",,,,,,,,,,,,,,,,,,,,,"B",,,,,,,"https://opendata.rdw.nl/resource/3huj-srit.json","https://opendata.rdw.nl/resource/8ys7-d773.json","https://opendata.rdw.nl/resource/vezc-m2t6.json","https://opendata.rdw.nl/resource/jhie-znh9.json","https://opendata.rdw.nl/resource/kmfi-hrps.json"
"GD311Z","Personenauto","BMW","420D","20240518",,"5419","sedan","5","GRIJS","Niet geregistreerd","4","1995","1515","2100","1615","745","1600","20150425","20150425","Geen verstrekking in Open Data","59286","Nee",,,,,,,"4","4","0","0",,"464","0","M1",,,"r. schroefveerkoker","2100","3C",,"e1*2007/46*0316*13","4E91","6A150000","0","0.09","281","Ja","Ja",,"Nee","3775","0",,"2023","Logisch","00","Nee","2024-05-18T00:00:00.000",,"2015-04-25T00:00:00.000","2015-04-25T00:00:00.000",,,,,,,,,,,,,,,,,,,,,"B",,,,,,,"https://opendata.rdw.nl/resource/3huj-srit.json","https://opendata.rdw.nl/resource/8ys7-d773.json","https://opendata.rdw.nl/resource/vezc-m2t6.json","https://opendata.rdw.nl/resource/jhie-znh9.json","https://opendata.rdw.nl/resource/kmfi-hrps.json"
"GF558D","Personenauto","BMW","420D","20240629",,"6831","sedan","5","BLAUW","Niet geregistreerd","4","1995","1515","2100","1615","745","1600","20150502","20150502","Geen verstrekking in Open Data","56167","Nee",,,,,,,"4","4","0","0",,"464","0","M1",,,"r. schroefveerkoker","2100","3C",,"e1*2007/46*0316*13","4E91","6A250000","0","0.09","281","Ja","Nee",,"Nee","3775","0",,"2023","Logisch","00","Nee","2024-06-29T00:00:00.000",,"2015-05-02T00:00:00.000","2015-05-02T00:00:00.000",,,,,,,,,,,,,,,,,,,,,"C",,,,,,,"https://opendata.rdw.nl/resource/3huj-srit.json","https://opendata.rdw.nl/resource/8ys7-d773.json","https://opendata.rdw.nl/resource/vezc-m2t6.json","https://opendata.rdw.nl/resource/jhie-znh9.json","https://opendata.rdw.nl/resource/kmfi-hrps.json"
"GF985V","Personenauto","BMW","420D","20240621","20210119","5419","sedan","5","BLAUW","Niet geregistreerd","4","1995","1515","2100","1615","745","1600","20150508","20150508","Geen verstrekking in Open Data","52507","Nee",,,,,,,"4","4","0","0",,"464","0","M1",,,"r. schroefveerkoker","2100","3C",,"e1*2007/46*0316*13","4E91","6A150000","0","0.09","281","Ja","Ja",,"Nee","3775","0",,"2024","Logisch","00","Nee","2024-06-21T00:00:00.000","2021-01-19T00:00:00.000","2015-05-08T00:00:00.000","2015-05-08T00:00:00.000",,,,,,,,,,,,,,,,,,,,,"B",,,,,,,"https://opendata.rdw.nl/resource/3huj-srit.json","https://opendata.rdw.nl/resource/8ys7-d773.json","https://opendata.rdw.nl/resource/vezc-m2t6.json","https://opendata.rdw.nl/resource/jhie-znh9.json","https://opendata.rdw.nl/resource/kmfi-hrps.json"
"GG418V","Personenauto","BMW","420D","20230618",,"6831","sedan","5","GRIJS","Niet geregistreerd","4","1995","1515","2100","1615","745","1600","20150521","20150521","Geen verstrekking in Open Data","60621","Nee",,,,,,,"4","4","0","0",,"464","0","M1",,,"r. schroefveerkoker","2100","3C",,"e1*2007/46*0316*13","4E91","6A250000","0","0.09","281","Ja","Nee",,"Nee","3775","0",,"2022","Logisch","00","Nee","2023-06-18T00:00:00.000",,"2015-05-21T00:00:00.000","2015-05-21T00:00:00.000",,,,,,,,,,,,,,,,,,,,,"C",,,,,,,"https://opendata.rdw.nl/resource/3huj-srit.json","https://opendata.rdw.nl/resource/8ys7-d773.json","https://opendata.rdw.nl/resource/vezc-m2t6.json","https://opendata.rdw.nl/resource/jhie-znh9.json","https://opendata.rdw.nl/resource/kmfi-hrps.json"
"GG770K","Personenauto","BMW","420D","20240625",,"5419","sedan","5","GRIJS","Niet geregistreerd","4","1995","1515","2100","1615","745","1600","20150519","20150519","Geen verstrekking in Open Data","54507","Nee",,,,,,,"4","4","0","0",,"464","0","M1",,,"r. schroefveerkoker","2100","3C",,"e1*2007/46*0316*13","4E91","6A150000","0","0.09","281","Ja","Nee",,"Nee","3775","0",,"2023","Logisch","00","Nee","2024-06-25T00:00:00.000",,"2015-05-19T00:00:00.000","2015-05-19T00:00:00.000",,,,,,,,,,,,,,,,,,,,,"B",,,,,,,"https://opendata.rdw.nl/resource/3huj-srit.json","https://opendata.rdw.nl/resource/8ys7-d773.json","https://opendata.rdw.nl/resource/vezc-m2t6.json","https://opendata.rdw.nl/resource/jhie-znh9.json","https://opendata.rdw.nl/resource/kmfi-hrps.json"
"GH064K","Personenauto","BMW","420D","20230526",,"5419","sedan","5","ROOD","Niet geregistreerd","4","1995","1515","2100","1615","745","1600","20150526","20150526","Geen verstrekking in Open Data","62446","Nee",,,,,,,"4","4","0","0",,"464","0","M1",,,"r. schroefveerkoker","2100","3C",,"e1*2007/46*0316*13","4E91","6A150000","0","0.09","281","Ja","Ja",,"Nee","3775","0",,"2023","Logisch","00","Nee","2023-05-26T00:00:00.000",,"2015-05-26T00:00:00.000","2015-05-26T00:00:00.000",,,,,,,,,,,,,,,,,,,,,"B",,,,,,,"https://opendata.rdw.nl/resource/3huj-srit.json","https://opendata.rdw.nl/resource/8ys7-d773.json","https://opendata.rdw.nl/resource/vezc-m2t6.json","https://opendata.rdw.nl/resource/jhie-znh9.json","https://opendata.rdw.nl/resource/kmfi-hrps.json"
"GH831G","Personenauto","BMW","420D XDRIVE","20240117",,"7541","sedan","5","ZWART","Niet geregistreerd","4","1995","1575","2160","1675","750","1600","20150107","20150725","Geen verstrekking in Open Data","72422","Nee",,,,,,,"4","4","0","0",,"464","0","M1",,,"r. schroefveerkoker","2160","3C",,"e1*2007/46*0316*10","4B71","6A250000","0","0.08","281","Ja","Ja",,"Nee","3835","0",,"2023","Geen oordeel","05","Nee","2024-01-17T00:00:00.000",,"2015-01-07T00:00:00.000","2015-07-25T00:00:00.000",,,,,,,,,,,,,,,,,,,,,"D",,,,,,,"https://opendata.rdw.nl/resource/3huj-srit.json","https://opendata.rdw.nl/resource/8ys7-d773.json","https://opendata.rdw.nl/resource/vezc-m2t6.json","https://opendata.rdw.nl/resource/jhie-znh9.json","https://opendata.rdw.nl/resource/kmfi-hrps.json"
"GJ452K","Personenauto","BMW","420D","20240718",,"5419","sedan","5","BLAUW","Niet geregistreerd","4","1995","1515","2100","1615","745","1600","20150609","20150609","Geen verstrekking in Open Data","52036","Nee",,,,,,,"4","4","0","0",,"464","0","M1",,,"r. schroefveerkoker","2100","3C",,"e1*2007/46*0316*13","4E91","6A150000","0","0.09","281","Ja","Nee",,"Nee","3775","0",,"2023","Logisch","00","Nee","2024-07-18T00:00:00.000",,"2015-06-09T00:00:00.000","2015-06-09T00:00:00.000",,,,,,,,,,,,,,,,,,,,,"B",,,,,,,"https://opendata.rdw.nl/resource/3huj-srit.json","https://opendata.rdw.nl/resource/8ys7-d773.json","https://opendata.rdw.nl/resource/vezc-m2t6.json","https://opendata.rdw.nl/resource/jhie-znh9.json","https://opendata.rdw.nl/resource/kmfi-hrps.json"
"GK069B","Personenauto","BMW","420D","20220804",,"5419","sedan","5","ZWART","Niet geregistreerd","4","1995","1515","2100","1615","745","1600","20150612","20150612","Geen verstrekking in Open Data","55626","Nee",,,,,,,"4","4","0","0",,"464","0","M1",,,"r. schroefveerkoker","2100","3C",,"e1*2007/46*0316*13","4E91","6A150000","0","0.09","281","Ja","Nee",,"Nee","3775","0",,"2022","Logisch","00","Nee","2022-08-04T00:00:00.000",,"2015-06-12T00:00:00.000","2015-06-12T00:00:00.000",,,,,,,,,,,,,,,,,,,,,"B",,,,,,,"https://opendata.rdw.nl/resource/3huj-srit.json","https://opendata.rdw.nl/resource/8ys7-d773.json","https://opendata.rdw.nl/resource/vezc-m2t6.json","https://opendata.rdw.nl/resource/jhie-znh9.json","https://opendata.rdw.nl/resource/kmfi-hrps.json"
"GK852R","Personenauto","BMW","420D","20231122",,"4889","sedan","5","ZWART","Niet geregistreerd","4","1995","1500","2085","1600","745","1600","20140828","20150814","Geen verstrekking in Open Data","60026","Nee",,,,,,,"4","4","0","0",,"464","0","M1",,,"r. motorruimte","2085","3C",,"e1*2007/46*0316*11","4B51","6A150000","0","0.08","281","Ja","Ja",,"Nee","3760","0",,"2022","Geen oordeel","05","Nee","2023-11-22T00:00:00.000",,"2014-08-28T00:00:00.000","2015-08-14T00:00:00.000",,,,,,,,,,,,,,,,,,,,,"C",,,,,,,"https://opendata.rdw.nl/resource/3huj-srit.json","https://opendata.rdw.nl/resource/8ys7-d773.json","https://opendata.rdw.nl/resource/vezc-m2t6.json","https://opendata.rdw.nl/resource/jhie-znh9.json","https://opendata.rdw.nl/resource/kmfi-hrps.json"