"kenteken","voertuigsoort","merk","handelsbenaming","vervaldatum_apk","datum_tenaamstelling","bruto_bpm","inrichting","aantal_zitplaatsen","eerste_kleur","tweede_kleur","aantal_cilinders","cilinderinhoud","massa_ledig_voertuig","toegestane_maximum_massa_voertuig","massa_rijklaar","maximum_massa_trekken_ongeremd","maximum_trekken_massa_geremd","datum_eerste_toelating","datum_eerste_tenaamstelling_in_nederland","wacht_op_keuren","catalogusprijs","wam_verzekerd","maximale_constructiesnelheid","laadvermogen","oplegger_geremd","aanhangwagen_autonoom_geremd","aanhangwagen_middenas_geremd","aantal_staanplaatsen","aantal_deuren","aantal_wielen","afstand_hart_koppeling_tot_achterzijde_voertuig","afstand_voorzijde_voertuig_tot_hart_koppeling","afwijkende_maximum_snelheid","lengte","breedte","europese_voertuigcategorie","europese_voertuigcategorie_toevoeging","europese_uitvoeringcategorie_toevoeging","plaats_chassisnummer","technische_max_massa_voertuig","type","type_gasinstallatie","typegoedkeuringsnummer","variant","uitvoering","volgnummer_wijziging_eu_typegoedkeuring","vermogen_massarijklaar","wielbasis","export_indicator","openstaande_terugroepactie_indicator","vervaldatum_tachograaf","taxi_indicator","maximum_massa_samenstelling","aantal_rolstoelplaatsen","maximum_ondersteunende_snelheid","jaar_laatste_registratie_tellerstand","tellerstandoordeel","code_toelichting_tellerstandoordeel","tenaamstellen_mogelijk","vervaldatum_apk_dt","datum_tenaamstelling_dt","datum_eerste_toelating_dt","datum_eerste_tenaamstelling_in_nederland_dt","vervaldatum_tachograaf_dt","maximum_last_onder_de_vooras_sen_tezamen_koppeling","type_remsysteem_voertuig_code","rupsonderstelconfiguratiecode","wielbasis_voertuig_minimum","wielbasis_voertuig_maximum","lengte_voertuig_minimum","lengte_voertuig_maximum","breedte_voertuig_minimum","breedte_voertuig_maximum","hoogte_voertuig","hoogte_voertuig_minimum","hoogte_voertuig_maximum","massa_bedrijfsklaar_minimaal","massa_bedrijfsklaar_maximaal","technisch_toelaatbaar_massa_koppelpunt","maximum_massa_technisch_maximaal","maximum_massa_technisch_minimaal","subcategorie_nederland","verticale_belasting_koppelpunt_getrokken_voertuig","zuinigheidsclassificatie","registratie_datum_goedkeuring_afschrijvingsmoment_bpm","registratie_datum_goedkeuring_afschrijvingsmoment_bpm_dt","gem_lading_wrde","aerodyn_voorz","massa_alt_aandr","verl_cab_ind","api_gekentekende_voertuigen_assen","api_gekentekende_voertuigen_brandstof","api_gekentekende_voertuigen_carrosserie","api_gekentekende_voertuigen_carrosserie_specifiek","api_gekentekende_voertuigen_voertuigklasse"
"1XLX77","Personenauto","BMW","420D","20230426",,"4946","cabriolet","4","BLAUW","Niet geregistreerd","4","1995","1665","2160","1765","745","1600","20140401","20141110","Geen verstrekking in Open Data","78135","Nee",,,,,,,"2","4","0","0",,"464","0","M1",,,"r. motorruimte","2160","3C",,"e1*2007/46*0316*10","3U11","6A140000","0","0.08","281","Ja","Ja",,"Nee","3835","0",,"2023","Geen oordeel","05","Nee","2023-04-26T00:00:00.000",,"2014-04-01T00:00:00.000","2014-11-10T00:00:00.000",,"0",,,,,,,,,,,,,,,,,,,"D",,,,,,,"https://opendata.rdw.nl/resource/3huj-srit.json","https://opendata.rdw.nl/resource/8ys7-d773.json","https://opendata.rdw.nl/resource/vezc-m2t6.json","https://opendata.rdw.nl/resource/jhie-znh9.json","https://opendata.rdw.nl/resource/kmfi-hrps.json"
"GB375X","Personenauto","BMW","420D","20240626",,"8567","cabriolet","4","WIT","Niet geregistreerd","4","1995","1665","2160","1765","745","1600","20140605","20150413","Geen verstrekking in Open Data","75437","Nee",,,,,,,"2","4","0","0",,"464","0","M1",,,"r. motorruimte","2160","3C",,"e1*2007/46*0316*09","3U11","6A240000","0","0.08","281","Ja","Nee",,"Nee","3835","0",,"2023","Geen oordeel","05","Nee","2024-06-26T00:00:00.000",,"2014-06-05T00:00:00.000","2015-04-13T00:00:00.000",,,,,,,,,,,,,,,,,,,,,"D",,,,,,,"https://opendata.rdw.nl/resource/3huj-srit.json","https://opendata.rdw.nl/resource/8ys7-d773.json","https://opendata.rdw.nl/resource/vezc-m2t6.json","https://opendata.rdw.nl/resource/jhie-znh9.json","https://opendata.rdw.nl/resource/kmfi-hrps.json"
"GD316Z","Personenauto","BMW","420D","20241128",,"10197","cabriolet","4","GRIJS","Niet geregistreerd","4","1995","1665","2160","1765","745","1600","20150428","20150428","Geen verstrekking in Open Data","74668","Nee",,,,,,,"2","4","0","0",,"464","0","M1",,,"r. schroefveerkoker","2160","3C",,"e1*2007/46*0316*12","3U11","6A240000","0","0.08","281","Ja","Ja",,"Nee","3835","0",,"2023","Logisch","00","Nee","2024-11-28T00:00:00.000",,"2015-04-28T00:00:00.000","2015-04-28T00:00:00.000",,,,,,,,,,,,,,,,,,,,,"D",,,,,,,"https://opendata.rdw.nl/resource/3huj-srit.json","https://opendata.rdw.nl/resource/8ys7-d773.json","https://opendata.rdw.nl/resource/vezc-m2t6.json","https://opendata.rdw.nl/resource/jhie-znh9.json","https://opendata.rdw.nl/resource/kmfi-hrps.json"
"GS531N","Personenauto","BMW","420D","20230623",,"8083","cabriolet","4","GRIJS","Niet geregistreerd","4","1995","1665","2160","1765","745","1600","20140528","20150805","Geen verstrekking in Open Data","66596","Nee",,,,,,,"2","4","0","0",,"464","0","M1",,,"r. motorruimte","2160","3C",,"e1*2007/46*0316*10","3U11","6A140000","0","0.08","281","Ja","Nee",,"Nee","3835","0",,"2022","Geen oordeel","05","Nee","2023-06-23T00:00:00.000",,"2014-05-28T00:00:00.000","2015-08-05T00:00:00.000",,,,,,,,,,,,,,,,,,,,,"D",,,,,,,"https://opendata.rdw.nl/resource/3huj-srit.json","https://opendata.rdw.nl/resource/8ys7-d773.json","https://opendata.rdw.nl/resource/vezc-m2t6.json","https://opendata.rdw.nl/resource/jhie-znh9.json","https://opendata.rdw.nl/resource/kmfi-hrps.json"
"HT177J","Personenauto","BMW","420D","20240915",,"8811","cabriolet","4","ZWART","Niet geregistreerd","4","1995","1690","2185","1790","745","1600","20160104","20160104","Geen verstrekking in Open Data","70856","Nee",,,,,,,"2","4","0","0",,"464","183","M1",,,"in motorruimte r.","2185","3C",,"e1*2007/46*0316*14","4U31","6A240000","0","0.08","281","Ja","Nee",,"Nee","3860","0","0.00","2023","Onlogisch","04","Nee","2024-09-15T00:00:00.000",,"2016-01-04T00:00:00.000","2016-01-04T00:00:00.000",,,,,,,,,,,"138",,,,,,,,,,"E",,,,,,,"https://opendata.rdw.nl/resource/3huj-srit.json","https://opendata.rdw.nl/resource/8ys7-d773.json","https://opendata.rdw.nl/resource/vezc-m2t6.json","https://opendata.rdw.nl/resource/jhie-znh9.json","https://opendata.rdw.nl/resource/kmfi-hrps.json"
"JB764G","Personenauto","BMW","420D","20231004",,"12616","cabriolet","4","BLAUW","Niet geregistreerd","4","1995","1655","2150","1755","745","1600","20160129","20160129","Geen verstrekking in Open Data","73598","Nee",,,,,,,"2","4","0","0",,"464","183","M1",,,"in motorruimte r.","2150","3C",,"e1*2007/46*0316*11","3U11","6H240000","0","0.08","281","Ja","Nee",,"Nee","3825","0","0.00","2023","Logisch","00","Nee","2023-10-04T00:00:00.000",,"2016-01-29T00:00:00.000","2016-01-29T00:00:00.000",,,,,,,,,,,"138",,,,,,,,,,"G",,,,,,,"https://opendata.rdw.nl/resource/3huj-srit.json","https://opendata.rdw.nl/resource/8ys7-d773.json","https://opendata.rdw.nl/resource/vezc-m2t6.json","https://opendata.rdw.nl/resource/jhie-znh9.json","https://opendata.rdw.nl/resource/kmfi-hrps.json"
"JD410R","Personenauto","BMW","420D","20230226",,"6726","cabriolet","4","WIT","Niet geregistreerd","4","1995","1665","2160","1765","745","1600","20150226","20160216","Geen verstrekking in Open Data","75884","Nee",,,,,,,"2","4","0","0",,"464","0","M1",,,"r. schroefveerkoker","2160","3C",,"e1*2007/46*0316*11","3U11","6A240000","0","0.08","281","Ja","Ja",,"Nee","3835","0","0.00","2022","Geen oordeel","05","Nee","2023-02-26T00:00:00.000",,"2015-02-26T00:00:00.000","2016-02-16T00:00:00.000",,,,,,,,,,,,,,,,,,,,,"D",,,,,,,"https://opendata.rdw.nl/resource/3huj-srit.json","https://opendata.rdw.nl/resource/8ys7-d773.json","https://opendata.rdw.nl/resource/vezc-m2t6.json","https://opendata.rdw.nl/resource/jhie-znh9.json","https://opendata.rdw.nl/resource/kmfi-hrps.json"
"K325ZF","Personenauto","BMW","420D",,,"3418","cabriolet","4","WIT","Niet geregistreerd","4","1995","1690","2185","1790","745","1600","20170915","20210331","Geen verstrekking in Open Data","77503","Nee","228",,,,,,"2","4","0","0",,"464","183","M1",,,,"2185","3C",,"e1*2007/46*0316*18","8S11","6A240000","0","0.08","281","Ja","Nee",,"Nee","3860","0","0.00","2023","Geen oordeel","05","Nee",,,"2017-09-15T00:00:00.000","2021-03-31T00:00:00.000",,,,,,,,,,,"138",,,,,,,,,,"E",,,,,,,"https://opendata.rdw.nl/resource/3huj-srit.json","https://opendata.rdw.nl/resource/8ys7-d773.json","https://opendata.rdw.nl/resource/vezc-m2t6.json","https://opendata.rdw.nl/resource/jhie-znh9.json","https://opendata.rdw.nl/resource/kmfi-hrps.json"
"KD512P","Personenauto","BMW","420D","20231205",,"6213","cabriolet","4","ZWART","Niet geregistreerd","4","1995","1665","2160","1765","745","1600","20140528","20160801","Geen verstrekking in Open Data","70480","Nee",,,,,,,"2","4","0","0",,"464","0","M1",,,"r. schroefveerkoker","2160","3C",,"e1*2007/46*0316*10","3U11","6A140000","0","0.08","281","Ja","Nee",,"Nee","3835","0",,"2022","Onlogisch","04","Nee","2023-12-05T00:00:00.000",,"2014-05-28T00:00:00.000","2016-08-01T00:00:00.000",,,,,,,,,,,,,,,,,,,,,"D",,,,,,,"https://opendata.rdw.nl/resource/3huj-srit.json","https://opendata.rdw.nl/resource/8ys7-d773.json","https://opendata.rdw.nl/resource/vezc-m2t6.json","https://opendata.rdw.nl/resource/jhie-znh9.json","https://opendata.rdw.nl/resource/kmfi-hrps.json"
"PT893G","Personenauto","BMW","420D","20240326","20200326","10197","cabriolet","4","ZWART","Niet geregistreerd","4","1995","1665","2160","1765","745","1600","20150401","20180601","Geen verstrekking in Open Data","60205","Nee",,,,,,,"2","4","0","0",,"464","0","M1",,,"r. motorruimte","2160","3C",,"e1*2007/46*0316*12","3U11","6A240000","0","0.08","281","Ja","Ja",,"Nee","3835","0",,"2024","Geen oordeel","05","Nee","2024-03-26T00:00:00.000","2020-03-26T00:00:00.000","2015-04-01T00:00:00.000","2018-06-01T00:00:00.000",,,,,,,,,,,,,,,,,,,,,"D",,,,,,,"https://opendata.rdw.nl/resource/3huj-srit.json","https://opendata.rdw.nl/resource/8ys7-d773.json","https://opendata.rdw.nl/resource/vezc-m2t6.json","https://opendata.rdw.nl/resource/jhie-znh9.json","https://opendata.rdw.nl/resource/kmfi-hrps.json"
"PZ169H","Personenauto","BMW","420D","20220930",,"7436","cabriolet","4","GRIJS","Niet geregistreerd","4","1995","1690","2185","1790","745","1600","20160930","20171013","Geen verstrekking in Open Data","67397","Nee",,,,,,,"2","4","0","0",,"464","0","M1",,,"r. motorruimte","2185","3C",,"e1*2007/46*0316*16","4U31","6A240000","0","0.08","281","Ja","Nee",,"Nee","3860","0","0.00","2022","Geen oordeel","05","Nee","2022-09-30T00:00:00.000",,"2016-09-30T00:00:00.000","2017-10-13T00:00:00.000",,,,,,,,,,,,,,,,,,,,,"E",,,,,,,"https://opendata.rdw.nl/resource/3huj-srit.json","https://opendata.rdw.nl/resource/8ys7-d773.json","https://opendata.rdw.nl/resource/vezc-m2t6.json","https://opendata.rdw.nl/resource/jhie-znh9.json","https://opendata.rdw.nl/resource/kmfi-hrps.json"
"RL280X","Personenauto","BMW","420D","20240314",,"6584","cabriolet","4","ZWART","Niet geregistreerd","4","1995","1690","2185","1790","745","1600","20170314","20180326","Geen verstrekking in Open Data","71591","Nee",,,,,,,"2","4","0","0",,"464","0","M1",,,,"2185","3C",,"e1*2007/46*0316*16","4U31","6A240000","0","0.08","281","Ja","Nee",,"Nee","3860","0","0.00","2023","Geen oordeel","05","Nee","2024-03-14T00:00:00.000",,"2017-03-14T00:00:00.000","2018-03-26T00:00:00.000",,,,,,,,,,,,,,,,,,,,,"E",,,,,,,"https://opendata.rdw.nl/resource/3huj-srit.json","https://opendata.rdw.nl/resource/8ys7-d773.json","https://opendata.rdw.nl/resource/vezc-m2t6.json","https://opendata.rdw.nl/resource/jhie-znh9.json","https://opendata.rdw.nl/resource/kmfi-hrps.json"
"RR514T","Personenauto","BMW","420D","20230215",,"2716","cabriolet","4","GRIJS","Niet geregistreerd","4","1995","1655","2150","1755","745","1600","20140627","20180129","Geen verstrekking in Open Data","65643","Nee",,,,,,,"2","4","0","0",,"464","0","M1",,,"r. motorruimte","2150","3C",,"e1*2007/46*0316*10","3U11","6H140000","0","0.08","281","Ja","Nee",,"Nee","3825","0","0.00","2022","Geen oordeel","05","Nee","2023-02-15T00:00:00.000",,"2014-06-27T00:00:00.000","2018-01-29T00:00:00.000",,,,,,,,,,,,,,,,,,,,,"E",,,,,,,"https://opendata.rdw.nl/resource/3huj-srit.json","https://opendata.rdw.nl/resource/8ys7-d773.json","https://opendata.rdw.nl/resource/vezc-m2t6.json","https://opendata.rdw.nl/resource/jhie-znh9.json","https://opendata.rdw.nl/resource/kmfi-hrps.json"
"RS822R","Personenauto","BMW","420D","20240110",,"7178","cabriolet","4","BLAUW","Niet geregistreerd","4","1995","1665","2160","1765","745","1600","20140821","20180118","Geen verstrekking in Open Data","70929","Nee",,,,,,,"2","4","0","0",,"464","0","M1",,,"r. schroefveerkoker","2160","3C",,"e1*2007/46*0316*11","3U11","6A140000","0","0.08","281","Ja","Nee",,"Nee","3835","0",,"2023","Geen oordeel","05","Nee","2024-01-10T00:00:00.000",,"2014-08-21T00:00:00.000","2018-01-18T00:00:00.000",,,,,,,,,,,,,,,,,,,,,"D",,,,,,,"https://opendata.rdw.nl/resource/3huj-srit.json","https://opendata.rdw.nl/resource/8ys7-d773.json","https://opendata.rdw.nl/resource/vezc-m2t6.json","https://opendata.rdw.nl/resource/jhie-znh9.json","https://opendata.rdw.nl/resource/kmfi-hrps.json"
"SB441B","Personenauto","BMW","420D","20231231",,"6727","cabriolet","4","BRUIN","Niet geregistreerd","4","1995","1665","2160","1765","745","1600","20131126","20180301","Geen verstrekking in Open Data","83121","Nee",,,,,,,"2","4","0","0",,"464","0","M1",,,"r. motorruimte","2160","3C",,"e1*2007/46*0316*09","3U11","6A240000","0","0.08","281","Ja","Ja",,"Nee","3835","0",,"2022","Geen oordeel","05","Nee","2023-12-31T00:00:00.000",,"2013-11-26T00:00:00.000","2018-03-01T00:00:00.000",,,,,,,,,,,,,,,,,,,,,"B",,,,,,,"https://opendata.rdw.nl/resource/3huj-srit.json","https://opendata.rdw.nl/resource/8ys7-d773.json","https://opendata.rdw.nl/resource/vezc-m2t6.json","https://opendata.rdw.nl/resource/jhie-znh9.json","https://opendata.rdw.nl/resource/kmfi-hrps.json"
"SB805H","Personenauto","BMW","420D","20230812",,"7975","cabriolet","4","BLAUW","Niet geregistreerd","4","1995","1690","2185","1790","745","1600","20170808","20180317","Geen verstrekking in Open Data","80204","Nee",,,,,,,"2","4","0","0",,"464","0","M1",,,"r. motorruimte","2185","3C",,"e1*2007/46*0316*18","8S11","6A240000","0","0.08","281","Ja","Nee",,"Nee","3860","0","0.00","2023","Geen oordeel","05","Nee","2023-08-12T00:00:00.000",,"2017-08-08T00:00:00.000","2018-03-17T00:00:00.000",,,,,,,,,,,,,,,,,,,,,"E",,,,,,,"https://opendata.rdw.nl/resource/3huj-srit.json","https://opendata.rdw.nl/resource/8ys7-d773.json","https://opendata.rdw.nl/resource/vezc-m2t6.json","https://opendata.rdw.nl/resource/jhie-znh9.json","https://opendata.rdw.nl/resource/kmfi-hrps.json"
"SV901R","Personenauto","BMW","420D","20230603",,"7321","cabriolet","4","WIT","Niet geregistreerd","4","1995","1665","2160","1765","745","1600","20140414","20180707","Geen verstrekking in Open Data","81623","Nee",,,,,,,"2","4","0","0",,"464","0","M1",,,,"2160","3C",,"e1*2007/46*0316*10","3U11","6A240000","0","0.08","281","Ja","Nee",,"Nee","3835","0",,"2023","Geen oordeel","05","Nee","2023-06-03T00:00:00.000",,"2014-04-14T00:00:00.000","2018-07-07T00:00:00.000",,,,,,,,,,,,,,,,,,,,,"D",,,,,,,"https://opendata.rdw.nl/resource/3huj-srit.json","https://opendata.rdw.nl/resource/8ys7-d773.json","https://opendata.rdw.nl/resource/vezc-m2t6.json","https://opendata.rdw.nl/resource/jhie-znh9.json","https://opendata.rdw.nl/resource/kmfi-hrps.json"
"TP335R","Personenauto","BMW","420D","20241024",,"2029","cabriolet","4","WIT","Niet geregistreerd","4","1995","1665","2160","1765","745","1600","20140827","20180920","Geen verstrekking in Open Data","70629","Nee",,,,,,,"2","4","0","0",,"464","0","M1",,,"r. motorruimte","2160","3C",,"e1*2007/46*0316*10","3U11","6A240000","0","0.08","281","Ja","Nee",,"Nee","3835","0",,"2023","Geen oordeel","05","Nee","2024-10-24T00:00:00.000",,"2014-08-27T00:00:00.000","2018-09-20T00:00:00.000",,,,,,,,,,,,,,,,,,,,,"D",,,,,,,"https://opendata.rdw.nl/resource/3huj-srit.json","https://opendata.rdw.nl/resource/8ys7-d773.json","https://opendata.rdw.nl/resource/vezc-m2t6.json","https://opendata.rdw.nl/resource/jhie-znh9.json","https://opendata.rdw.nl/resource/kmfi-hrps.json"
"ZD077Z","Personenauto","BMW","420D","20240507","20240126","11531","cabriolet","4","WIT","Niet geregistreerd","4","1995","1740","2230","1840","745","1600","20190507","20190507","Geen verstrekking in Open Data","78535","Ja",,,,,,,"2","4","0","0",,"464","183","M1",,,,"2230","3C",,"e1*2007/46*0316*22","8S11","DAW400L0","0","0.08","281","Ja","Nee",,"Nee","3830","0","0.00","2024","Logisch","00","Nee","2024-05-07T00:00:00.000","2024-01-26T00:00:00.000","2019-05-07T00:00:00.000","2019-05-07T00:00:00.000",,,,,,,,,,,"138",,,,,,,,,,,,,,,,,"https://opendata.rdw.nl/resource/3huj-srit.json","https://opendata.rdw.nl/resource/8ys7-d773.json","https://opendata.rdw.nl/resource/vezc-m2t6.json","https://opendata.rdw.nl/resource/jhie-znh9.json","https://opendata.rdw.nl/resource/kmfi-hrps.json"
