"kenteken","voertuigsoort","merk","handelsbenaming","vervaldatum_apk","datum_tenaamstelling","bruto_bpm","inrichting","aantal_zitplaatsen","eerste_kleur","tweede_kleur","aantal_cilinders","cilinderinhoud","massa_ledig_voertuig","toegestane_maximum_massa_voertuig","massa_rijklaar","maximum_massa_trekken_ongeremd","maximum_trekken_massa_geremd","datum_eerste_toelating","datum_eerste_tenaamstelling_in_nederland","wacht_op_keuren","catalogusprijs","wam_verzekerd","maximale_constructiesnelheid","laadvermogen","oplegger_geremd","aanhangwagen_autonoom_geremd","aanhangwagen_middenas_geremd","aantal_staanplaatsen","aantal_deuren","aantal_wielen","afstand_hart_koppeling_tot_achterzijde_voertuig","afstand_voorzijde_voertuig_tot_hart_koppeling","afwijkende_maximum_snelheid","lengte","breedte","europese_voertuigcategorie","europese_voertuigcategorie_toevoeging","europese_uitvoeringcategorie_toevoeging","plaats_chassisnummer","technische_max_massa_voertuig","type","type_gasinstallatie","typegoedkeuringsnummer","variant","uitvoering","volgnummer_wijziging_eu_typegoedkeuring","vermogen_massarijklaar","wielbasis","export_indicator","openstaande_terugroepactie_indicator","vervaldatum_tachograaf","taxi_indicator","maximum_massa_samenstelling","aantal_rolstoelplaatsen","maximum_ondersteunende_snelheid","jaar_laatste_registratie_tellerstand","tellerstandoordeel","code_toelichting_tellerstandoordeel","tenaamstellen_mogelijk","vervaldatum_apk_dt","datum_tenaamstelling_dt","datum_eerste_toelating_dt","datum_eerste_tenaamstelling_in_nederland_dt","vervaldatum_tachograaf_dt","maximum_last_onder_de_vooras_sen_tezamen_koppeling","type_remsysteem_voertuig_code","rupsonderstelconfiguratiecode","wielbasis_voertuig_minimum","wielbasis_voertuig_maximum","lengte_voertuig_minimum","lengte_voertuig_maximum","breedte_voertuig_minimum","breedte_voertuig_maximum","hoogte_voertuig","hoogte_voertuig_minimum","hoogte_voertuig_maximum","massa_bedrijfsklaar_minimaal","massa_bedrijfsklaar_maximaal","technisch_toelaatbaar_massa_koppelpunt","maximum_massa_technisch_maximaal","maximum_massa_technisch_minimaal","subcategorie_nederland","verticale_belasting_koppelpunt_getrokken_voertuig","zuinigheidsclassificatie","registratie_datum_goedkeuring_afschrijvingsmoment_bpm","registratie_datum_goedkeuring_afschrijvingsmoment_bpm_dt","gem_lading_wrde","aerodyn_voorz","massa_alt_aandr","verl_cab_ind","api_gekentekende_voertuigen_assen","api_gekentekende_voertuigen_brandstof","api_gekentekende_voertuigen_carrosserie","api_gekentekende_voertuigen_carrosserie_specifiek","api_gekentekende_voertuigen_voertuigklasse"
"H508SX","Personenauto","BMW","X5 XDRIVE40E","20240909",,"642","stationwagen","5","BRUIN","Niet geregistreerd","4","1997","2205","2980","2305","750","2700","20160524","20200915","Geen verstrekking in Open Data","101675","Nee","210",,,,,,"4","4","0","0",,"489","194","M1",,,"r. motorruimte","2980","X5",,"e1*2007/46*0421*16","KT01","6A250000","0","0.02","293","Ja","Nee",,"Nee","5820","0","0.00","2024","Geen oordeel","05","Nee","2024-09-09T00:00:00.000",,"2016-05-24T00:00:00.000","2020-09-15T00:00:00.000",,,,,,,,,,,"176",,,,,,,,,,"A",,,,,,,"https://opendata.rdw.nl/resource/3huj-srit.json","https://opendata.rdw.nl/resource/8ys7-d773.json","https://opendata.rdw.nl/resource/vezc-m2t6.json","https://opendata.rdw.nl/resource/jhie-znh9.json","https://opendata.rdw.nl/resource/kmfi-hrps.json"
"HF769L","Personenauto","BMW","X5 XDRIVE40E","20240714",,"643","stationwagen","5","GRIJS","Niet geregistreerd","4","1997","2205","2980","2305","750","2700","20151103","20151103","Geen verstrekking in Open Data","99158","Nee",,,,,,,"4","4","0","0",,"489","0","M1",,,"in motorruimte r.","2980","X5",,"e1*2007/46*0421*16","KT01","6A250000","0","0.08","293","Ja","Nee",,"Nee","5820","0","0.00","2022","Logisch","00","Nee","2024-07-14T00:00:00.000",,"2015-11-03T00:00:00.000","2015-11-03T00:00:00.000",,,,,,,,,,,,,,,,,,,,,"A",,,,,,,"https://opendata.rdw.nl/resource/3huj-srit.json","https://opendata.rdw.nl/resource/8ys7-d773.json","https://opendata.rdw.nl/resource/vezc-m2t6.json","https://opendata.rdw.nl/resource/jhie-znh9.json","https://opendata.rdw.nl/resource/kmfi-hrps.json"
"HG318L","Personenauto","BMW","X5 XDRIVE40E","20240904",,"643","stationwagen","5","GRIJS","Niet geregistreerd","4","1997","2205","2980","2305","750","2700","20151030","20151030","Geen verstrekking in Open Data","100138","Nee",,,,,,,"4","4","0","0",,"489","194","M1",,,"in motorruimte r.","2980","X5",,"e1*2007/46*0421*16","KT01","6A25000K","0","0.08","293","Ja","Nee",,"Nee","5820","0","0.00","2023","Logisch","00","Nee","2024-09-04T00:00:00.000",,"2015-10-30T00:00:00.000","2015-10-30T00:00:00.000",,,,,,,,,,,"176",,,,,,,,,,"A",,,,,,,"https://opendata.rdw.nl/resource/3huj-srit.json","https://opendata.rdw.nl/resource/8ys7-d773.json","https://opendata.rdw.nl/resource/vezc-m2t6.json","https://opendata.rdw.nl/resource/jhie-znh9.json","https://opendata.rdw.nl/resource/kmfi-hrps.json"
"HG420T","Personenauto","BMW","X5 XDRIVE40E","20231030",,"637","stationwagen","5","GRIJS","Niet geregistreerd","4","1997","2205","2980","2305","750","2700","20151030","20151030","Geen verstrekking in Open Data","95678","Nee",,,,,,,"4","4","0","0",,"489","194","M1",,,"in motorruimte r.","2980","X5",,"e1*2007/46*0421*16","KT01","6A15000K","0","0.08","293","Ja","Nee",,"Nee","5820","0","0.00","2023","Logisch","00","Nee","2023-10-30T00:00:00.000",,"2015-10-30T00:00:00.000","2015-10-30T00:00:00.000",,,,,,,,,,,"176",,,,,,,,,,"A",,,,,,,"https://opendata.rdw.nl/resource/3huj-srit.json","https://opendata.rdw.nl/resource/8ys7-d773.json","https://opendata.rdw.nl/resource/vezc-m2t6.json","https://opendata.rdw.nl/resource/jhie-znh9.json","https://opendata.rdw.nl/resource/kmfi-hrps.json"
"HJ396P","Personenauto","BMW","X5 XDRIVE40E",,"20240307","643","stationwagen","5","ZWART","Niet geregistreerd","4","1997","2205","2980","2305","750","2700","20151113","20151113","Geen verstrekking in Open Data","109004","Nee",,,,,,,"4","4","0","0",,"489","194","M1",,,"in motorruimte r.","2980","X5",,"e1*2007/46*0421*16","KT01","6A250000","0","0.08","293","Ja","Nee",,"Nee","5820","0","0.00","2024","Logisch","00","Nee",,"2024-03-07T00:00:00.000","2015-11-13T00:00:00.000","2015-11-13T00:00:00.000",,,,,,,,,,,"176",,,,,,,,,,"A",,,,,,,"https://opendata.rdw.nl/resource/3huj-srit.json","https://opendata.rdw.nl/resource/8ys7-d773.json","https://opendata.rdw.nl/resource/vezc-m2t6.json","https://opendata.rdw.nl/resource/jhie-znh9.json","https://opendata.rdw.nl/resource/kmfi-hrps.json"
"HJ401P","Personenauto","BMW","X5 XDRIVE40E","20231119",,"643","stationwagen","5","GRIJS","Niet geregistreerd","4","1997","2205","2980","2305","750","2700","20151119","20151119","Geen verstrekking in Open Data","107807","Nee",,,,,,,"4","4","0","0",,"489","194","M1",,,"in motorruimte r.","2980","X5",,"e1*2007/46*0421*16","KT01","6A250000","0","0.08","293","Ja","Ja",,"Nee","5820","0","0.00","2022","Logisch","00","Nee","2023-11-19T00:00:00.000",,"2015-11-19T00:00:00.000","2015-11-19T00:00:00.000",,,,,,,,,,,"176",,,,,,,,,,"A",,,,,,,"https://opendata.rdw.nl/resource/3huj-srit.json","https://opendata.rdw.nl/resource/8ys7-d773.json","https://opendata.rdw.nl/resource/vezc-m2t6.json","https://opendata.rdw.nl/resource/jhie-znh9.json","https://opendata.rdw.nl/resource/kmfi-hrps.json"
"HJ882S","Personenauto","BMW","X5 XDRIVE40E","20241025",,"643","stationwagen","5","ZWART","Niet geregistreerd","4","1997","2205","2980","2305","750","2700","20151116","20151116","Geen verstrekking in Open Data","110563","Nee",,,,,,,"4","4","0","0",,"489","194","M1",,,"in motorruimte r.","2980","X5",,"e1*2007/46*0421*16","KT01","6A25000K","0","0.08","293","Ja","Ja",,"Nee","5820","0","0.00","2022","Onlogisch","04","Nee","2024-10-25T00:00:00.000",,"2015-11-16T00:00:00.000","2015-11-16T00:00:00.000",,,,,,,,,,,"176",,,,,,,,,,"A",,,,,,,"https://opendata.rdw.nl/resource/3huj-srit.json","https://opendata.rdw.nl/resource/8ys7-d773.json","https://opendata.rdw.nl/resource/vezc-m2t6.json","https://opendata.rdw.nl/resource/jhie-znh9.json","https://opendata.rdw.nl/resource/kmfi-hrps.json"
"HJ930S","Personenauto","BMW","X5 XDRIVE40E","20231114","20240415","637","stationwagen","5","ZWART","Niet geregistreerd","4","1997","2205","2980","2305","750","2700","20151114","20151114","Geen verstrekking in Open Data","99011","Ja",,,,,,,"4","4","0","0",,"489","194","M1",,,"in motorruimte r.","2980","X5",,"e1*2007/46*0421*16","KT01","6A150000","0","0.08","293","Ja","Nee",,"Nee","5820","0","0.00","2024","Logisch","00","Nee","2023-11-14T00:00:00.000","2024-04-15T00:00:00.000","2015-11-14T00:00:00.000","2015-11-14T00:00:00.000",,,,,,,,,,,"176",,,,,,,,,,"A",,,,,,,"https://opendata.rdw.nl/resource/3huj-srit.json","https://opendata.rdw.nl/resource/8ys7-d773.json","https://opendata.rdw.nl/resource/vezc-m2t6.json","https://opendata.rdw.nl/resource/jhie-znh9.json","https://opendata.rdw.nl/resource/kmfi-hrps.json"
"HK278D","Personenauto","BMW","X5 XDRIVE40E","20231119",,"643","stationwagen","5","ZWART","Niet geregistreerd","4","1997","2205","2980","2305","750","2700","20151119","20151119","Geen verstrekking in Open Data","104243","Nee",,,,,,,"4","4","0","0",,"489","0","M1",,,"in motorruimte r.","2980","X5",,"e1*2007/46*0421*16","KT01","6A25000K","0","0.08","293","Ja","Ja",,"Nee","5820","0","0.00","2022","Logisch","00","Nee","2023-11-19T00:00:00.000",,"2015-11-19T00:00:00.000","2015-11-19T00:00:00.000",,,,,,,,,,,,,,,,,,,,,"A",,,,,,,"https://opendata.rdw.nl/resource/3huj-srit.json","https://opendata.rdw.nl/resource/8ys7-d773.json","https://opendata.rdw.nl/resource/vezc-m2t6.json","https://opendata.rdw.nl/resource/jhie-znh9.json","https://opendata.rdw.nl/resource/kmfi-hrps.json"
"HK308G","Personenauto","BMW","X5 XDRIVE40E","20241104",,"643","stationwagen","5","ZWART","Niet geregistreerd","4","1997","2205","2980","2305","750","2700","20151120","20151120","Geen verstrekking in Open Data","96306","Nee",,,,,,,"4","4","0","0",,"489","194","M1",,,"in motorruimte r.","2980","X5",,"e1*2007/46*0421*16","KT01","6A250000","0","0.08","293","Ja","Ja",,"Nee","5820","0","0.00","2023","Logisch","00","Nee","2024-11-04T00:00:00.000",,"2015-11-20T00:00:00.000","2015-11-20T00:00:00.000",,,,,,,,,,,"176",,,,,,,,,,"A",,,,,,,"https://opendata.rdw.nl/resource/3huj-srit.json","https://opendata.rdw.nl/resource/8ys7-d773.json","https://opendata.rdw.nl/resource/vezc-m2t6.json","https://opendata.rdw.nl/resource/jhie-znh9.json","https://opendata.rdw.nl/resource/kmfi-hrps.json"
"HL224L","Personenauto","BMW","X5 XDRIVE40E","20250129","20240123","637","stationwagen","5","GRIJS","Niet geregistreerd","4","1997","2205","2980","2305","750","2700","20151126","20151126","Geen verstrekking in Open Data","100562","Ja",,,,,,,"4","4","0","0",,"489","194","M1",,,"in motorruimte r.","2980","X5",,"e1*2007/46*0421*16","KT01","6A150000","0","0.08","293","Ja","Nee",,"Nee","5820","0","0.00","2024","Onlogisch","04","Nee","2025-01-29T00:00:00.000","2024-01-23T00:00:00.000","2015-11-26T00:00:00.000","2015-11-26T00:00:00.000",,,,,,,,,,,"176",,,,,,,,,,"A",,,,,,,"https://opendata.rdw.nl/resource/3huj-srit.json","https://opendata.rdw.nl/resource/8ys7-d773.json","https://opendata.rdw.nl/resource/vezc-m2t6.json","https://opendata.rdw.nl/resource/jhie-znh9.json","https://opendata.rdw.nl/resource/kmfi-hrps.json"
"HL399R","Personenauto","BMW","X5 XDRIVE40E","20241216","20240130","637","stationwagen","5","BLAUW","Niet geregistreerd","4","1997","2205","2980","2305","750","2700","20151203","20151203","Geen verstrekking in Open Data","104106","Ja",,,,,,,"4","4","0","0",,"489","194","M1",,,"in motorruimte r.","2980","X5",,"e1*2007/46*0421*16","KT01","6A150000","0","0.08","293","Ja","Nee",,"Nee","5820","0","0.00","2024","Logisch","00","Nee","2024-12-16T00:00:00.000","2024-01-30T00:00:00.000","2015-12-03T00:00:00.000","2015-12-03T00:00:00.000",,,,,,,,,,,"176",,,,,,,,,,"A",,,,,,,"https://opendata.rdw.nl/resource/3huj-srit.json","https://opendata.rdw.nl/resource/8ys7-d773.json","https://opendata.rdw.nl/resource/vezc-m2t6.json","https://opendata.rdw.nl/resource/jhie-znh9.json","https://opendata.rdw.nl/resource/kmfi-hrps.json"
"HL573L","Personenauto","BMW","X5 XDRIVE40E","20231127",,"643","stationwagen","5","GRIJS","Niet geregistreerd","4","1997","2205","2980","2305","750","2700","20151127","20151127","Geen verstrekking in Open Data","114746","Nee",,,,,,,"4","4","0","0",,"489","194","M1",,,"in motorruimte r.","2980","X5",,"e1*2007/46*0421*16","KT01","6A25000K","0","0.08","293","Ja","Ja",,"Nee","5820","0","0.00","2023","Logisch","00","Nee","2023-11-27T00:00:00.000",,"2015-11-27T00:00:00.000","2015-11-27T00:00:00.000",,,,,,,,,,,"176",,,,,,,,,,"A",,,,,,,"https://opendata.rdw.nl/resource/3huj-srit.json","https://opendata.rdw.nl/resource/8ys7-d773.json","https://opendata.rdw.nl/resource/vezc-m2t6.json","https://opendata.rdw.nl/resource/jhie-znh9.json","https://opendata.rdw.nl/resource/kmfi-hrps.json"
"HL579L","Personenauto","BMW","X5 XDRIVE40E","20231211",,"643","stationwagen","5","ZWART","Niet geregistreerd","4","1997","2205","2980","2305","750","2700","20151202","20151202","Geen verstrekking in Open Data","99760","Nee",,,,,,,"4","4","0","0",,"489","194","M1",,,"in motorruimte r.","2980","X5",,"e1*2007/46*0421*16","KT01","6A25000K","0","0.08","293","Ja","Ja",,"Nee","5820","0","0.00","2022","Logisch","00","Nee","2023-12-11T00:00:00.000",,"2015-12-02T00:00:00.000","2015-12-02T00:00:00.000",,,,,,,,,,,"176",,,,,,,,,,"A",,,,,,,"https://opendata.rdw.nl/resource/3huj-srit.json","https://opendata.rdw.nl/resource/8ys7-d773.json","https://opendata.rdw.nl/resource/vezc-m2t6.json","https://opendata.rdw.nl/resource/jhie-znh9.json","https://opendata.rdw.nl/resource/kmfi-hrps.json"
"HL883F","Personenauto","BMW","X5 XDRIVE40E","20241212","20201126","637","stationwagen","5","ZWART","Niet geregistreerd","4","1997","2205","2980","2305","750","2700","20151127","20151127","Geen verstrekking in Open Data","97790","Nee",,,,,,,"4","4","0","0",,"489","194","M1",,,"in motorruimte r.","2980","X5",,"e1*2007/46*0421*16","KT01","6A15000K","0","0.08","293","Ja","Nee",,"Nee","5820","0","0.00","2023","Logisch","00","Nee","2024-12-12T00:00:00.000","2020-11-26T00:00:00.000","2015-11-27T00:00:00.000","2015-11-27T00:00:00.000",,,,,,,,,,,"176",,,,,,,,,,"A",,,,,,,"https://opendata.rdw.nl/resource/3huj-srit.json","https://opendata.rdw.nl/resource/8ys7-d773.json","https://opendata.rdw.nl/resource/vezc-m2t6.json","https://opendata.rdw.nl/resource/jhie-znh9.json","https://opendata.rdw.nl/resource/kmfi-hrps.json"
"HN222F","Personenauto","BMW","X5 XDRIVE40E","20231203",,"637","stationwagen","5","GRIJS","Niet geregistreerd","4","1997","2205","2980","2305","750","2700","20151203","20151203","Geen verstrekking in Open Data","94049","Nee",,,,,,,"4","4","0","0",,"489","0","M1",,,"in motorruimte r.","2980","X5",,"e1*2007/46*0421*16","KT01","6A15000K","0","0.08","293","Ja","Nee",,"Nee","5820","0","0.00","2022","Logisch","00","Nee","2023-12-03T00:00:00.000",,"2015-12-03T00:00:00.000","2015-12-03T00:00:00.000",,,,,,,,,,,,,,,,,,,,,"A",,,,,,,"https://opendata.rdw.nl/resource/3huj-srit.json","https://opendata.rdw.nl/resource/8ys7-d773.json","https://opendata.rdw.nl/resource/vezc-m2t6.json","https://opendata.rdw.nl/resource/jhie-znh9.json","https://opendata.rdw.nl/resource/kmfi-hrps.json"
"HP081N","Personenauto","BMW","X5 XDRIVE40E","20231217",,"643","stationwagen","5","ZWART","Niet geregistreerd","4","1997","2205","2980","2305","750","2700","20151217","20151217","Geen verstrekking in Open Data","103385","Nee",,,,,,,"4","4","0","0",,"489","194","M1",,,"in motorruimte r.","2980","X5",,"e1*2007/46*0421*16","KT01","6A25000K","0","0.08","293","Ja","Ja",,"Nee","5820","0","0.00","2023","Logisch","00","Nee","2023-12-17T00:00:00.000",,"2015-12-17T00:00:00.000","2015-12-17T00:00:00.000",,,,,,,,,,,"176",,,,,,,,,,"A",,,,,,,"https://opendata.rdw.nl/resource/3huj-srit.json","https://opendata.rdw.nl/resource/8ys7-d773.json","https://opendata.rdw.nl/resource/vezc-m2t6.json","https://opendata.rdw.nl/resource/jhie-znh9.json","https://opendata.rdw.nl/resource/kmfi-hrps.json"
"HP355N","Personenauto","BMW","X5 XDRIVE40E","20241215","20240213","643","stationwagen","5","WIT","Niet geregistreerd","4","1997","2205","2980","2305","750","2700","20151211","20151211","Geen verstrekking in Open Data","107441","Ja",,,,,,,"4","4","0","0",,"489","194","M1",,,"in motorruimte r.","2980","X5",,"e1*2007/46*0421*16","KT01","6A250000","0","0.08","293","Ja","Ja",,"Nee","5820","0","0.00","2024","Logisch","00","Nee","2024-12-15T00:00:00.000","2024-02-13T00:00:00.000","2015-12-11T00:00:00.000","2015-12-11T00:00:00.000",,,,,,,,,,,"176",,,,,,,,,,"A",,,,,,,"https://opendata.rdw.nl/resource/3huj-srit.json","https://opendata.rdw.nl/resource/8ys7-d773.json","https://opendata.rdw.nl/resource/vezc-m2t6.json","https://opendata.rdw.nl/resource/jhie-znh9.json","https://opendata.rdw.nl/resource/kmfi-hrps.json"
"HR168B","Personenauto","BMW","X5 XDRIVE40E","20231218",,"637","stationwagen","5","WIT","Niet geregistreerd","4","1997","2205","2980","2305","750","2700","20151218","20151218","Geen verstrekking in Open Data","97827","Nee",,,,,,,"4","4","0","0",,"489","194","M1",,,"in motorruimte r.","2980","X5",,"e1*2007/46*0421*16","KT01","6A150000","0","0.08","293","Ja","Nee",,"Nee","5820","0","0.00","2023","Onlogisch","04","Nee","2023-12-18T00:00:00.000",,"2015-12-18T00:00:00.000","2015-12-18T00:00:00.000",,,,,,,,,,,"176",,,,,,,,,,"A",,,,,,,"https://opendata.rdw.nl/resource/3huj-srit.json","https://opendata.rdw.nl/resource/8ys7-d773.json","https://opendata.rdw.nl/resource/vezc-m2t6.json","https://opendata.rdw.nl/resource/jhie-znh9.json","https://opendata.rdw.nl/resource/kmfi-hrps.json"
"HR174B","Personenauto","BMW","X5 XDRIVE40E","20231216",,"643","stationwagen","5","ZWART","Niet geregistreerd","4","1997","2205","2980","2305","750","2700","20151216","20151216","Geen verstrekking in Open Data","102721","Nee",,,,,,,"4","4","0","0",,"489","194","M1",,,"in motorruimte r.","2980","X5",,"e1*2007/46*0421*16","KT01","6A250000","0","0.08","293","Ja","Nee",,"Nee","5820","0","0.00","2023","Logisch","00","Nee","2023-12-16T00:00:00.000",,"2015-12-16T00:00:00.000","2015-12-16T00:00:00.000",,,,,,,,,,,"176",,,,,,,,,,"A",,,,,,,"https://opendata.rdw.nl/resource/3huj-srit.json","https://opendata.rdw.nl/resource/8ys7-d773.json","https://opendata.rdw.nl/resource/vezc-m2t6.json","https://opendata.rdw.nl/resource/jhie-znh9.json","https://opendata.rdw.nl/resource/kmfi-hrps.json"
"HR259V","Personenauto","BMW","X5 XDRIVE40E","20231227",,"643","stationwagen","5","GRIJS","Niet geregistreerd","4","1997","2205","2980","2305","750","2700","20151218","20151218","Geen verstrekking in Open Data","99348","Nee",,,,,,,"4","4","0","0",,"489","194","M1",,,"in motorruimte r.","2980","X5",,"e1*2007/46*0421*16","KT01","6A250000","0","0.08","293","Ja","Ja",,"Nee","5820","0","0.00","2023","Logisch","00","Nee","2023-12-27T00:00:00.000",,"2015-12-18T00:00:00.000","2015-12-18T00:00:00.000",,,,,,,,,,,"176",,,,,,,,,,"A",,,,,,,"https://opendata.rdw.nl/resource/3huj-srit.json","https://opendata.rdw.nl/resource/8ys7-d773.json","https://opendata.rdw.nl/resource/vezc-m2t6.json","https://opendata.rdw.nl/resource/jhie-znh9.json","https://opendata.rdw.nl/resource/kmfi-hrps.json"
"HS786V","Personenauto","BMW","X5 XDRIVE40E","20231228",,"637","stationwagen","5","GRIJS","Niet geregistreerd","4","1997","2205","2980","2305","750","2700","20151228","20151228","Geen verstrekking in Open Data","102371","Nee",,,,,,,"4","4","0","0",,"489","0","M1",,,"in motorruimte r.","2980","X5",,"e1*2007/46*0421*16","KT01","6A150000","0","0.08","293","Ja","Nee",,"Nee","5820","0","0.00","2022","Logisch","00","Nee","2023-12-28T00:00:00.000",,"2015-12-28T00:00:00.000","2015-12-28T00:00:00.000",,,,,,,,,,,,,,,,,,,,,"A",,,,,,,"https://opendata.rdw.nl/resource/3huj-srit.json","https://opendata.rdw.nl/resource/8ys7-d773.json","https://opendata.rdw.nl/resource/vezc-m2t6.json","https://opendata.rdw.nl/resource/jhie-znh9.json","https://opendata.rdw.nl/resource/kmfi-hrps.json"
"HS887D","Personenauto","BMW","X5 XDRIVE40E",,,"637","stationwagen","5","ZWART","Niet geregistreerd","4","1997","2205","2980","2305","750","2700","20151228","20151228","Geen verstrekking in Open Data","94952","Nee",,,,,,,"4","4","0","0",,"489","0","M1",,,"in motorruimte r.","2980","X5",,"e1*2007/46*0421*16","KT01","6A150000","0","0.08","293","Ja","Nee",,"Nee","5820","0","0.00","2022","Logisch","00","Nee",,,"2015-12-28T00:00:00.000","2015-12-28T00:00:00.000",,,,,,,,,,,,,,,,,,,,,"A",,,,,,,"https://opendata.rdw.nl/resource/3huj-srit.json","https://opendata.rdw.nl/resource/8ys7-d773.json","https://opendata.rdw.nl/resource/vezc-m2t6.json","https://opendata.rdw.nl/resource/jhie-znh9.json","https://opendata.rdw.nl/resource/kmfi-hrps.json"
"HT020J","Personenauto","BMW","X5 XDRIVE40E",,,"637","stationwagen","5","GRIJS","Niet geregistreerd","4","1997","2205","2980","2305","750","2700","20151231","20151231","Geen verstrekking in Open Data","83906","Nee",,,,,,,"4","4","0","0",,"489","0","M1",,,"in motorruimte r.","2980","X5",,"e1*2007/46*0421*16","KT01","6A150000","0","0.08","293","Ja","Nee",,"Nee","5820","0","0.00","2022","Logisch","00","Nee",,,"2015-12-31T00:00:00.000","2015-12-31T00:00:00.000",,,,,,,,,,,,,,,,,,,,,"A",,,,,,,"https://opendata.rdw.nl/resource/3huj-srit.json","https://opendata.rdw.nl/resource/8ys7-d773.json","https://opendata.rdw.nl/resource/vezc-m2t6.json","https://opendata.rdw.nl/resource/jhie-znh9.json","https://opendata.rdw.nl/resource/kmfi-hrps.json"
"HT037T","Personenauto","BMW","X5 XDRIVE40E","20230604",,"637","stationwagen","5","GRIJS","Niet geregistreerd","4","1997","2205","2980","2305","750","2700","20151229","20151229","Geen verstrekking in Open Data","98072","Nee",,,,,,,"4","4","0","0",,"489","0","M1",,,"in motorruimte r.","2980","X5",,"e1*2007/46*0421*16","KT01","6A150000","0","0.08","293","Ja","Nee",,"Nee","5820","0","0.00","2022","Logisch","00","Nee","2023-06-04T00:00:00.000",,"2015-12-29T00:00:00.000","2015-12-29T00:00:00.000",,,,,,,,,,,,,,,,,,,,,"A",,,,,,,"https://opendata.rdw.nl/resource/3huj-srit.json","https://opendata.rdw.nl/resource/8ys7-d773.json","https://opendata.rdw.nl/resource/vezc-m2t6.json","https://opendata.rdw.nl/resource/jhie-znh9.json","https://opendata.rdw.nl/resource/kmfi-hrps.json"
"HT267J","Personenauto","BMW","X5 XDRIVE40E","20231230",,"643","stationwagen","5","GRIJS","Niet geregistreerd","4","1997","2205","2980","2305","750","2700","20151230","20151230","Geen verstrekking in Open Data","99348","Nee",,,,,,,"4","4","0","0",,"489","0","M1",,,"in motorruimte r.","2980","X5",,"e1*2007/46*0421*16","KT01","6A250000","0","0.08","293","Ja","Ja",,"Nee","5820","0","0.00","2022","Logisch","00","Nee","2023-12-30T00:00:00.000",,"2015-12-30T00:00:00.000","2015-12-30T00:00:00.000",,,,,,,,,,,,,,,,,,,,,"A",,,,,,,"https://opendata.rdw.nl/resource/3huj-srit.json","https://opendata.rdw.nl/resource/8ys7-d773.json","https://opendata.rdw.nl/resource/vezc-m2t6.json","https://opendata.rdw.nl/resource/jhie-znh9.json","https://opendata.rdw.nl/resource/kmfi-hrps.json"
"HT713J","Personenauto","BMW","X5 XDRIVE40E","20231011",,"643","stationwagen","5","GRIJS","Niet geregistreerd","4","1997","2205","2980","2305","750","2700","20151230","20151230","Geen verstrekking in Open Data","100895","Nee",,,,,,,"4","4","0","0",,"489","194","M1",,,"in motorruimte r.","2980","X5",,"e1*2007/46*0421*16","KT01","6A250000","0","0.08","293","Ja","Nee",,"Nee","5820","0","0.00","2023","Logisch","00","Nee","2023-10-11T00:00:00.000",,"2015-12-30T00:00:00.000","2015-12-30T00:00:00.000",,,,,,,,,,,"176",,,,,,,,,,"A",,,,,,,"https://opendata.rdw.nl/resource/3huj-srit.json","https://opendata.rdw.nl/resource/8ys7-d773.json","https://opendata.rdw.nl/resource/vezc-m2t6.json","https://opendata.rdw.nl/resource/jhie-znh9.json","https://opendata.rdw.nl/resource/kmfi-hrps.json"