"kenteken","voertuigsoort","merk","handelsbenaming","vervaldatum_apk","datum_tenaamstelling","bruto_bpm","inrichting","aantal_zitplaatsen","eerste_kleur","tweede_kleur","aantal_cilinders","cilinderinhoud","massa_ledig_voertuig","toegestane_maximum_massa_voertuig","massa_rijklaar","maximum_massa_trekken_ongeremd","maximum_trekken_massa_geremd","datum_eerste_toelating","datum_eerste_tenaamstelling_in_nederland","wacht_op_keuren","catalogusprijs","wam_verzekerd","maximale_constructiesnelheid","laadvermogen","oplegger_geremd","aanhangwagen_autonoom_geremd","aanhangwagen_middenas_geremd","aantal_staanplaatsen","aantal_deuren","aantal_wielen","afstand_hart_koppeling_tot_achterzijde_voertuig","afstand_voorzijde_voertuig_tot_hart_koppeling","afwijkende_maximum_snelheid","lengte","breedte","europese_voertuigcategorie","europese_voertuigcategorie_toevoeging","europese_uitvoeringcategorie_toevoeging","plaats_chassisnummer","technische_max_massa_voertuig","type","type_gasinstallatie","typegoedkeuringsnummer","variant","uitvoering","volgnummer_wijziging_eu_typegoedkeuring","vermogen_massarijklaar","wielbasis","export_indicator","openstaande_terugroepactie_indicator","vervaldatum_tachograaf","taxi_indicator","maximum_massa_samenstelling","aantal_rolstoelplaatsen","maximum_ondersteunende_snelheid","jaar_laatste_registratie_tellerstand","tellerstandoordeel","code_toelichting_tellerstandoordeel","tenaamstellen_mogelijk","vervaldatum_apk_dt","datum_tenaamstelling_dt","datum_eerste_toelating_dt","datum_eerste_tenaamstelling_in_nederland_dt","vervaldatum_tachograaf_dt","maximum_last_onder_de_vooras_sen_tezamen_koppeling","type_remsysteem_voertuig_code","rupsonderstelconfiguratiecode","wielbasis_voertuig_minimum","wielbasis_voertuig_maximum","lengte_voertuig_minimum","lengte_voertuig_maximum","breedte_voertuig_minimum","breedte_voertuig_maximum","hoogte_voertuig","hoogte_voertuig_minimum","hoogte_voertuig_maximum","massa_bedrijfsklaar_minimaal","massa_bedrijfsklaar_maximaal","technisch_toelaatbaar_massa_koppelpunt","maximum_massa_technisch_maximaal","maximum_massa_technisch_minimaal","subcategorie_nederland","verticale_belasting_koppelpunt_getrokken_voertuig","zuinigheidsclassificatie","registratie_datum_goedkeuring_afschrijvingsmoment_bpm","registratie_datum_goedkeuring_afschrijvingsmoment_bpm_dt","gem_lading_wrde","aerodyn_voorz","massa_alt_aandr","verl_cab_ind","api_gekentekende_voertuigen_assen","api_gekentekende_voertuigen_brandstof","api_gekentekende_voertuigen_carrosserie","api_gekentekende_voertuigen_carrosserie_specifiek","api_gekentekende_voertuigen_voertuigklasse"
"1KJZ93","Personenauto","BMW","5 SERIES","20230514",,"9752","stationwagen","5","ZWART","Niet geregistreerd","4","1995","1575","2200","1675","750","1800","20081023","20130506","Geen verstrekking in Open Data",,"Nee",,,,,,,"4","4","0","0",,"484","0","M1",,,"op r. schroefveerkoker onder motorkap","2200","560L",,"e1*2001/116*0230*14","PX31","5H","0","0.07","289","Ja","Nee",,"Nee","4060","0",,"2022","Geen oordeel","05","Nee","2023-05-14T00:00:00.000",,"2008-10-23T00:00:00.000","2013-05-06T00:00:00.000",,"0",,,,,,,,,,,,,,,,,,,"A",,,,,,,"https://opendata.rdw.nl/resource/3huj-srit.json","https://opendata.rdw.nl/resource/8ys7-d773.json","https://opendata.rdw.nl/resource/vezc-m2t6.json","https://opendata.rdw.nl/resource/jhie-znh9.json","https://opendata.rdw.nl/resource/kmfi-hrps.json"
"1TTF17","Personenauto","BMW","5 SERIES","20230502",,"15968","stationwagen","5","GRIJS","Niet geregistreerd","6","2993","1675","2300","1775","750","2000","20100310","20140508","Geen verstrekking in Open Data","114312","Nee",,,,,,,"4","4","0","0",,"484","0","M1",,,"op r. schroefveerkoker onder motorkap","2300","560L",,"e1*2001/116*0230*16","PX71","AB","0","0.10","289","Ja","Ja",,"Nee","4360","0",,"2023","Geen oordeel","05","Nee","2023-05-02T00:00:00.000",,"2010-03-10T00:00:00.000","2014-05-08T00:00:00.000",,"0",,,,,,,,,,,,,,,,,,,"D",,,,,,,"https://opendata.rdw.nl/resource/3huj-srit.json","https://opendata.rdw.nl/resource/8ys7-d773.json","https://opendata.rdw.nl/resource/vezc-m2t6.json","https://opendata.rdw.nl/resource/jhie-znh9.json","https://opendata.rdw.nl/resource/kmfi-hrps.json"
"1XZS34","Personenauto","BMW","5 SERIES","20220628",,"14475","sedan","5","GRIJS","Niet geregistreerd","6","2993","1695","2330","1795","750","2000","20100510","20141125","Geen verstrekking in Open Data","76460","Nee",,,,,,,"4","4","0","0",,"490","0","M1",,,"r. motorruimte","2330","5L",,"e1*2007/46*0363*01","FW51","5B","0","0.10","297","Ja","Nee",,"Nee","4420","0","0.00","2022","Geen oordeel","05","Nee","2022-06-28T00:00:00.000",,"2010-05-10T00:00:00.000","2014-11-25T00:00:00.000",,"0",,,,,,,,,,,,,,,,,,,"C",,,,,,,"https://opendata.rdw.nl/resource/3huj-srit.json","https://opendata.rdw.nl/resource/8ys7-d773.json","https://opendata.rdw.nl/resource/vezc-m2t6.json","https://opendata.rdw.nl/resource/jhie-znh9.json","https://opendata.rdw.nl/resource/kmfi-hrps.json"
"30TKV4","Personenauto","BMW","5 SERIES","20230523",,"14622","stationwagen","5","ZWART","Niet geregistreerd","6","2993","1745","2420","1845","750","2000","20110330","20120224","Geen verstrekking in Open Data","70344","Nee","230",,,,,,"4","4","0","0",,"491","186","M1",,,,"2420","5K",,"e1*2007/46*0455*02","MX31","5B","0","0.08","297","Ja","Nee",,"Nee","4510","0","0.00","2022","Geen oordeel","05","Nee","2023-05-23T00:00:00.000",,"2011-03-30T00:00:00.000","2012-02-24T00:00:00.000",,,,,,,,,,,"146",,,,,,,,,,"C","20220520","2022-05-20T00:00:00.000",,,,,"https://opendata.rdw.nl/resource/3huj-srit.json","https://opendata.rdw.nl/resource/8ys7-d773.json","https://opendata.rdw.nl/resource/vezc-m2t6.json","https://opendata.rdw.nl/resource/jhie-znh9.json","https://opendata.rdw.nl/resource/kmfi-hrps.json"
"30ZKT5","Personenauto","BMW","5 SERIES","20230303",,"2270","stationwagen","5","GRIJS","Niet geregistreerd","4","1995","1575","2200","1675","750","1800","20090630","20130208","Geen verstrekking in Open Data","64045","Nee",,,,,,,"4","4","0","0",,"484","0","M1",,,"op r. schroefveerkoker onder motorkap","2200","560L",,"e1*2001/116*0230*15","PX31","5H","0","0.07","289","Ja","Nee",,"Nee","4060","0",,"2022","Geen oordeel","05","Nee","2023-03-03T00:00:00.000",,"2009-06-30T00:00:00.000","2013-02-08T00:00:00.000",,"0",,,,,,,,,,,,,,,,,,,"A",,,,,,,"https://opendata.rdw.nl/resource/3huj-srit.json","https://opendata.rdw.nl/resource/8ys7-d773.json","https://opendata.rdw.nl/resource/vezc-m2t6.json","https://opendata.rdw.nl/resource/jhie-znh9.json","https://opendata.rdw.nl/resource/kmfi-hrps.json"
"3XFK93","Personenauto","BMW","5 SERIES","20230808",,"1106","sedan","5","GRIJS","Niet geregistreerd","6","2993","1575","2160","1675","750","2000","20100126","20140811","Geen verstrekking in Open Data","106734","Nee",,,,,,,"4","4","0","0",,"484","0","M1",,,"op r. schroefveerkoker onder motorkap","2160","560L",,"e1*2001/116*0230*14","NX71","AB","0","0.10","289","Ja","Nee",,"Nee","4220","0",,"2023","Geen oordeel","05","Nee","2023-08-08T00:00:00.000",,"2010-01-26T00:00:00.000","2014-08-11T00:00:00.000",,"0",,,,,,,,,,,,,,,,,,,"D",,,,,,,"https://opendata.rdw.nl/resource/3huj-srit.json","https://opendata.rdw.nl/resource/8ys7-d773.json","https://opendata.rdw.nl/resource/vezc-m2t6.json","https://opendata.rdw.nl/resource/jhie-znh9.json","https://opendata.rdw.nl/resource/kmfi-hrps.json"
"50XRP6","Personenauto","BMW","5 SERIES","20230318",,"3501","stationwagen","5","ZWART","Niet geregistreerd","6","2993","1675","2300","1775","750","2000","20100930","20120704","Geen verstrekking in Open Data","88025","Nee",,,,,,,"4","4","0","0",,"484","0","M1",,,"r. by kofferruimte","2300","560L",,"e1*2001/116*0230*16","PX71","AB","0","0.10","289","Ja","Nee",,"Nee","4360","0",,"2022","Niet geregistreerd","NG","Nee","2023-03-18T00:00:00.000",,"2010-09-30T00:00:00.000","2012-07-04T00:00:00.000",,,,,,,,,,,,,,,,,,,,,"D",,,,,,,"https://opendata.rdw.nl/resource/3huj-srit.json","https://opendata.rdw.nl/resource/8ys7-d773.json","https://opendata.rdw.nl/resource/vezc-m2t6.json","https://opendata.rdw.nl/resource/jhie-znh9.json","https://opendata.rdw.nl/resource/kmfi-hrps.json"
"5KHZ62","Personenauto","BMW","5 SERIES","20220603",,"10032","stationwagen","5","GRIJS","Niet geregistreerd","6","2993","1635","2260","1735","750","2000","20090105","20130502","Geen verstrekking in Open Data","66834","Nee",,,,,,,"4","4","0","0",,"484","0","M1",,,"op r. schroefveerkoker onder motorkap","2260","560L",,"e1*2001/116*0230*14","PX51","AA","0","0.08","289","Ja","Nee",,"Nee","4320","0",,"2022","Onlogisch","04","Nee","2022-06-03T00:00:00.000",,"2009-01-05T00:00:00.000","2013-05-02T00:00:00.000",,,,,,,,,,,,,,,,,,,,,"C",,,,,,,"https://opendata.rdw.nl/resource/3huj-srit.json","https://opendata.rdw.nl/resource/8ys7-d773.json","https://opendata.rdw.nl/resource/vezc-m2t6.json","https://opendata.rdw.nl/resource/jhie-znh9.json","https://opendata.rdw.nl/resource/kmfi-hrps.json"
"5KLV60","Personenauto","BMW","5 SERIES","20230529",,"11877","stationwagen","5","GRIJS","Niet geregistreerd","4","1995","1595","2200","1695","750","1800","20100211","20130528","Geen verstrekking in Open Data","61234","Nee",,,,,,,"4","4","0","0",,"484","0","M1",,,"op r. schroefveerkoker onder motorkap","2220","560L",,"e1*2001/116*0230*16","PX31","5B","0","0.08","289","Ja","Ja",,"Nee","4000","0",,"2022","Geen oordeel","05","Nee","2023-05-29T00:00:00.000",,"2010-02-11T00:00:00.000","2013-05-28T00:00:00.000",,"0",,,,,,,,,,,,,,,,,,,"C",,,,,,,"https://opendata.rdw.nl/resource/3huj-srit.json","https://opendata.rdw.nl/resource/8ys7-d773.json","https://opendata.rdw.nl/resource/vezc-m2t6.json","https://opendata.rdw.nl/resource/jhie-znh9.json","https://opendata.rdw.nl/resource/kmfi-hrps.json"
"6TLB79","Personenauto","BMW","5 SERIES","20230417",,"3455","stationwagen","5","GRIJS","Niet geregistreerd","4","1995","1575","2200","1675","750","1800","20101018","20140405","Geen verstrekking in Open Data","67114","Nee",,,,,,,"4","4","0","0",,"484","0","M1",,,"op r. schroefveerkoker onder motorkap","2200","560L",,"e1*2001/116*0230*16","PX31","5H","0","0.07","289","Ja","Nee",,"Nee","4060","0",,"2022","Geen oordeel","05","Nee","2023-04-17T00:00:00.000",,"2010-10-18T00:00:00.000","2014-04-05T00:00:00.000",,"0",,,,,,,,,,,,,,,,,,,"B",,,,,,,"https://opendata.rdw.nl/resource/3huj-srit.json","https://opendata.rdw.nl/resource/8ys7-d773.json","https://opendata.rdw.nl/resource/vezc-m2t6.json","https://opendata.rdw.nl/resource/jhie-znh9.json","https://opendata.rdw.nl/resource/kmfi-hrps.json"
"7TJD69","Personenauto","BMW","5 SERIES","20240430",,"8868","stationwagen","5","WIT","Niet geregistreerd","6","2993","1840","2520","1940","750","2000","20130430","20140304","Geen verstrekking in Open Data","96881","Nee",,,,,,,"4","4","0","0",,"491","0","M1",,,"r. motorruimte","2520","5K",,"e1*2007/46*0455*07","MW91","5A200","0","0.10","297","Ja","Nee",,"Nee","4610","0","0.00","2024","Geen oordeel","05","Nee","2024-04-30T00:00:00.000",,"2013-04-30T00:00:00.000","2014-03-04T00:00:00.000",,,,,,,,,,,,,,,,,,,,,"C",,,,,,,"https://opendata.rdw.nl/resource/3huj-srit.json","https://opendata.rdw.nl/resource/8ys7-d773.json","https://opendata.rdw.nl/resource/vezc-m2t6.json","https://opendata.rdw.nl/resource/jhie-znh9.json","https://opendata.rdw.nl/resource/kmfi-hrps.json"
"GT883V","Personenauto","BMW","5 SERIES","20230419",,"3427","sedan","5","GRIJS","Niet geregistreerd","4","1995","1705","2330","1805","750","2000","20150331","20150910","Geen verstrekking in Open Data","70235","Nee",,,,,,,"4","4","0","0",,"491","0","M1",,,"r. motorruimte","2330","5L",,"e1*2007/46*0363*12","5E71","6A250000","0","0.08","297","Ja","Nee",,"Nee","4420","0","0.00","2022","Geen oordeel","05","Nee","2023-04-19T00:00:00.000",,"2015-03-31T00:00:00.000","2015-09-10T00:00:00.000",,,,,,,,,,,,,,,,,,,,,"C",,,,,,,"https://opendata.rdw.nl/resource/3huj-srit.json","https://opendata.rdw.nl/resource/8ys7-d773.json","https://opendata.rdw.nl/resource/vezc-m2t6.json","https://opendata.rdw.nl/resource/jhie-znh9.json","https://opendata.rdw.nl/resource/kmfi-hrps.json"
"H393DR","Personenauto","BMW","5 SERIES","20230127",,"2095","stationwagen","5","ZWART","Niet geregistreerd","4","1995","1710","2385","1810","750","2000","20151231","20200129","Geen verstrekking in Open Data","66635","Nee","226",,,,,,"4","4","0","0",,"491","186","M1",,,,"2385","5K",,"e1*2007/46*0455*11","5L31","6A150000","0","0.08","297","Ja","Nee",,"Nee","4475","0","0.00","2022","Geen oordeel","05","Nee","2023-01-27T00:00:00.000",,"2015-12-31T00:00:00.000","2020-01-29T00:00:00.000",,,,,,,,,,,"146",,,,,,,,,,"B",,,,,,,"https://opendata.rdw.nl/resource/3huj-srit.json","https://opendata.rdw.nl/resource/8ys7-d773.json","https://opendata.rdw.nl/resource/vezc-m2t6.json","https://opendata.rdw.nl/resource/jhie-znh9.json","https://opendata.rdw.nl/resource/kmfi-hrps.json"
"H544JR","Personenauto","BMW","5 SERIES","20230218",,"4993","sedan","5","ZWART","Niet geregistreerd","4","1995","1625","2330","1725","750","2000","20190218","20200224","Geen verstrekking in Open Data","86955","Nee","232",,,,,,"4","4","0","0",,"494","187","M1",,,,"2330","G5L",,"e1*2007/46*1688*07","JF51","DAW500N0","0","0.08","298","Ja","Nee",,"Nee","4330","0","0.00","2023","Geen oordeel","05","Nee","2023-02-18T00:00:00.000",,"2019-02-18T00:00:00.000","2020-02-24T00:00:00.000",,,,,,,,,,,"148",,,,,,,,,,,,,,,,,"https://opendata.rdw.nl/resource/3huj-srit.json","https://opendata.rdw.nl/resource/8ys7-d773.json","https://opendata.rdw.nl/resource/vezc-m2t6.json","https://opendata.rdw.nl/resource/jhie-znh9.json","https://opendata.rdw.nl/resource/kmfi-hrps.json"
"J868SH","Personenauto","BMW","5 SERIES","20230301",,"12473","sedan","5","BLAUW","Niet geregistreerd","4","1995","1495","2060","1595","750","1800","20091211","20201005","Geen verstrekking in Open Data",,"Nee","229",,,,,,"4","4",,,,"484","185","M1",,,,"2060","560L",,,,,,"0.08","289","Ja","Nee",,"Nee","3920",,,"2022","Geen oordeel","05","Nee","2023-03-01T00:00:00.000",,"2009-12-11T00:00:00.000","2020-10-05T00:00:00.000",,,,,,,,,,,"147",,,,,,,,,,,,,,,,,"https://opendata.rdw.nl/resource/3huj-srit.json","https://opendata.rdw.nl/resource/8ys7-d773.json","https://opendata.rdw.nl/resource/vezc-m2t6.json","https://opendata.rdw.nl/resource/jhie-znh9.json","https://opendata.rdw.nl/resource/kmfi-hrps.json"
"JL740J","Personenauto","BMW","5 SERIES","20240114",,"3194","sedan","5","WIT","Niet geregistreerd","6","2993","1785","2410","1885","750","2000","20150513","20160423","Geen verstrekking in Open Data","84693","Nee",,,,,,,"4","4","0","0",,"491","0","M1",,,"r. motorruimte","2410","5L",,"e1*2007/46*0363*13","5D31","6A350000","0","0.10","297","Ja","Ja",,"Nee","4500","0","0.00","2023","Geen oordeel","05","Nee","2024-01-14T00:00:00.000",,"2015-05-13T00:00:00.000","2016-04-23T00:00:00.000",,,,,,,,,,,,,,,,,,,,,"D",,,,,,,"https://opendata.rdw.nl/resource/3huj-srit.json","https://opendata.rdw.nl/resource/8ys7-d773.json","https://opendata.rdw.nl/resource/vezc-m2t6.json","https://opendata.rdw.nl/resource/jhie-znh9.json","https://opendata.rdw.nl/resource/kmfi-hrps.json"
"L085KZ","Personenauto","BMW","5 SERIES","20240614",,"3681","stationwagen","5","ZWART","Niet geregistreerd","4","1995","1635","2390","1735","750","2000","20180614","20210804","Geen verstrekking in Open Data","61489","Nee","225",,,,,,"5","4",,,,"494","187","M1",,,,"2390","G5K",,"e1*2007/46*1750*03","JM71","CAW500L0","0","0.08","298","Ja","Nee",,"Nee","4390",,,"2023","Geen oordeel","05","Nee","2024-06-14T00:00:00.000",,"2018-06-14T00:00:00.000","2021-08-04T00:00:00.000",,,,,,,,,,,"150",,,,,,,,,,,,,,,,,"https://opendata.rdw.nl/resource/3huj-srit.json","https://opendata.rdw.nl/resource/8ys7-d773.json","https://opendata.rdw.nl/resource/vezc-m2t6.json","https://opendata.rdw.nl/resource/jhie-znh9.json","https://opendata.rdw.nl/resource/kmfi-hrps.json"
"NF371S","Personenauto","BMW","5 SERIES","20231103",,"1122","stationwagen","5","GRIJS","Niet geregistreerd","6","2993","1895","2530","1995","750","2000","20151009","20170105","Geen verstrekking in Open Data","92228","Nee",,,,,,,"4","4","0","0",,"491","0","M1",,,"r. motorruimte","2530","5K",,"e1*2007/46*0455*08","5K31","6A350000","0","0.10","297","Ja","Ja",,"Nee","4620","0","0.00","2023","Geen oordeel","05","Nee","2023-11-03T00:00:00.000",,"2015-10-09T00:00:00.000","2017-01-05T00:00:00.000",,,,,,,,,,,,,,,,,,,,,"E",,,,,,,"https://opendata.rdw.nl/resource/3huj-srit.json","https://opendata.rdw.nl/resource/8ys7-d773.json","https://opendata.rdw.nl/resource/vezc-m2t6.json","https://opendata.rdw.nl/resource/jhie-znh9.json","https://opendata.rdw.nl/resource/kmfi-hrps.json"
"NJ715B","Personenauto","BMW","5 SERIES","20240310",,"3021","sedan","5","BLAUW","Niet geregistreerd","4","1995","1605","2240","1705","750","2000","20141113","20170201","Geen verstrekking in Open Data","68708","Nee",,,,,,,"4","4","0","0",,"491","0","M1",,,"r. motorruimte","2240","5L",,"e1*2007/46*0363*12","5E51","6A150000","0","0.08","297","Ja","Nee",,"Nee","4330","0","0.00","2023","Geen oordeel","05","Nee","2024-03-10T00:00:00.000",,"2014-11-13T00:00:00.000","2017-02-01T00:00:00.000",,,,,,,,,,,,,,,,,,,,,"A",,,,,,,"https://opendata.rdw.nl/resource/3huj-srit.json","https://opendata.rdw.nl/resource/8ys7-d773.json","https://opendata.rdw.nl/resource/vezc-m2t6.json","https://opendata.rdw.nl/resource/jhie-znh9.json","https://opendata.rdw.nl/resource/kmfi-hrps.json"
"NS481T","Personenauto","BMW","5 SERIES","20231028",,"5352","stationwagen","5","ZWART","Niet geregistreerd","4","1995","1710","2385","1810","750","2000","20140818","20171003","Geen verstrekking in Open Data","68265","Nee",,,,,,,"4","4","0","0",,"491","0","M1",,,"r. motorruimte","2385","5K",,"e1*2007/46*0455*09","5L31","6A350000","0","0.08","297","Ja","Ja",,"Nee","4475","0","0.00","2023","Onlogisch","04","Nee","2023-10-28T00:00:00.000",,"2014-08-18T00:00:00.000","2017-10-03T00:00:00.000",,,,,,,,,,,,,,,,,,,,,"C",,,,,,,"https://opendata.rdw.nl/resource/3huj-srit.json","https://opendata.rdw.nl/resource/8ys7-d773.json","https://opendata.rdw.nl/resource/vezc-m2t6.json","https://opendata.rdw.nl/resource/jhie-znh9.json","https://opendata.rdw.nl/resource/kmfi-hrps.json"
"PT081N","Personenauto","BMW","5 SERIES","20231025",,"2886","sedan","5","WIT","Niet geregistreerd","4","1995","1600","2235","1700","750","2000","20140603","20171025","Geen verstrekking in Open Data","56471","Nee",,,,,,,"4","4","0","0",,"491","0","M1",,,"r. motorruimte","2235","5L",,"e1*2007/46*0363*10","5C11","6A150000","0","0.06","297","Ja","Nee",,"Nee","4325","0","0.00","2022","Geen oordeel","05","Nee","2023-10-25T00:00:00.000",,"2014-06-03T00:00:00.000","2017-10-25T00:00:00.000",,,,,,,,,,,,,,,,,,,,,"B",,,,,,,"https://opendata.rdw.nl/resource/3huj-srit.json","https://opendata.rdw.nl/resource/8ys7-d773.json","https://opendata.rdw.nl/resource/vezc-m2t6.json","https://opendata.rdw.nl/resource/jhie-znh9.json","https://opendata.rdw.nl/resource/kmfi-hrps.json"
"PZ725T","Personenauto","BMW","5 SERIES","20230404",,"5095","sedan","5","ZWART","Niet geregistreerd","4","1995","1605","2240","1705","750","2000","20160215","20171013","Geen verstrekking in Open Data","56694","Nee",,,,,,,"4","4","0","0",,"491","0","M1",,,"r. motorruimte","2240","5L",,"e1*2007/46*0363*14","5E51","6A250000","0","0.08","297","Ja","Nee",,"Nee","4330","0","0.00","2023","Onlogisch","04","Nee","2023-04-04T00:00:00.000",,"2016-02-15T00:00:00.000","2017-10-13T00:00:00.000",,,,,,,,,,,,,,,,,,,,,"C",,,,,,,"https://opendata.rdw.nl/resource/3huj-srit.json","https://opendata.rdw.nl/resource/8ys7-d773.json","https://opendata.rdw.nl/resource/vezc-m2t6.json","https://opendata.rdw.nl/resource/jhie-znh9.json","https://opendata.rdw.nl/resource/kmfi-hrps.json"
"R432TJ","Personenauto","BMW","5 SERIES",,,"1102","sedan","5","BLAUW","Niet geregistreerd","4","1998","1745","2420","1845",,,"20190416","20230510","Geen verstrekking in Open Data","82225","Nee","235",,,,,,"4","4",,,,"494","187","M1",,,,"2420","G5L",,"e1*2007/46*1688*08","JA91","DAW500M0","0","0.03","298","Ja","Nee",,"Nee",,,,"2023","Geen oordeel","05","Nee",,,"2019-04-16T00:00:00.000","2023-05-10T00:00:00.000",,,,,,,,,,,"148",,,,,,,,,,,"20221118","2022-11-18T00:00:00.000",,,,,"https://opendata.rdw.nl/resource/3huj-srit.json","https://opendata.rdw.nl/resource/8ys7-d773.json","https://opendata.rdw.nl/resource/vezc-m2t6.json","https://opendata.rdw.nl/resource/jhie-znh9.json","https://opendata.rdw.nl/resource/kmfi-hrps.json"
"RK662G","Personenauto","BMW","5 SERIES","20240117",,"6400","sedan","5","ZWART","Niet geregistreerd","4","1995","1605","2240","1705","750","2000","20160215","20171215","Geen verstrekking in Open Data","58408","Nee",,,,,,,"4","4","0","0",,"491","0","M1",,,"r. motorruimte","2240","5L",,"e1*2007/46*0363*14","5E51","6A250000","0","0.08","297","Ja","Nee",,"Nee","4330","0","0.00","2023","Geen oordeel","05","Nee","2024-01-17T00:00:00.000",,"2016-02-15T00:00:00.000","2017-12-15T00:00:00.000",,,,,,,,,,,,,,,,,,,,,"C",,,,,,,"https://opendata.rdw.nl/resource/3huj-srit.json","https://opendata.rdw.nl/resource/8ys7-d773.json","https://opendata.rdw.nl/resource/vezc-m2t6.json","https://opendata.rdw.nl/resource/jhie-znh9.json","https://opendata.rdw.nl/resource/kmfi-hrps.json"
"RR818N","Personenauto","BMW","5 SERIES","20230717",,"11439","stationwagen","5","ZWART","Niet geregistreerd","6","2993","1780","2455","1880","750","2000","20110804","20180109","Geen verstrekking in Open Data","86252","Nee",,,,,,,"4","4","0","0",,"491","0","M1",,,"r. motorruimte","2455","5K",,"e1*2007/46*0455*02","MX51","5B","0","0.10","297","Ja","Nee",,"Nee","4545","0","0.00","2023","Geen oordeel","05","Nee","2023-07-17T00:00:00.000",,"2011-08-04T00:00:00.000","2018-01-09T00:00:00.000",,,,,,,,,,,,,,,,,,,,,"C",,,,,,,"https://opendata.rdw.nl/resource/3huj-srit.json","https://opendata.rdw.nl/resource/8ys7-d773.json","https://opendata.rdw.nl/resource/vezc-m2t6.json","https://opendata.rdw.nl/resource/jhie-znh9.json","https://opendata.rdw.nl/resource/kmfi-hrps.json"
"RS148D","Personenauto","BMW","5 SERIES","20230619",,"18712","stationwagen","5","GRIJS","Niet geregistreerd","4","1995","1595","2220","1695","750","1800","20091119","20180110","Geen verstrekking in Open Data",,"Nee",,,,,,,"4","4","0","0",,"484","0","M1",,,"op r. schroefveerkoker onder motorkap","2220","560L",,"e1*2001/116*0230*16","PX32","AB","0","0.08","289","Ja","Ja",,"Nee","4080","0","0.00","2023","Geen oordeel","05","Nee","2023-06-19T00:00:00.000",,"2009-11-19T00:00:00.000","2018-01-10T00:00:00.000",,,,,,,,,,,,,,,,,,,,,"B",,,,,,,"https://opendata.rdw.nl/resource/3huj-srit.json","https://opendata.rdw.nl/resource/8ys7-d773.json","https://opendata.rdw.nl/resource/vezc-m2t6.json","https://opendata.rdw.nl/resource/jhie-znh9.json","https://opendata.rdw.nl/resource/kmfi-hrps.json"
"S049LN","Personenauto","BMW","5 SERIES",,,"623","sedan","5","GRIJS","Niet geregistreerd","4","1998","1810","2505","1910","750","1700","20211203","20230301","Geen verstrekking in Open Data","81414","Nee","235",,,,,,"4","4",,,,"496","187","M1",,,,"2505","G5L",,"e1*2007/46*1688*14","11AG","IAW50000","0","0.03","298","Ja","Nee",,"Nee","4205",,,"2023","Geen oordeel","05","Nee",,,"2021-12-03T00:00:00.000","2023-03-01T00:00:00.000",,,,,,,,,,,"148",,,,,,,,,,,"20230222","2023-02-22T00:00:00.000",,,,,"https://opendata.rdw.nl/resource/3huj-srit.json","https://opendata.rdw.nl/resource/8ys7-d773.json","https://opendata.rdw.nl/resource/vezc-m2t6.json","https://opendata.rdw.nl/resource/jhie-znh9.json","https://opendata.rdw.nl/resource/kmfi-hrps.json"