"kenteken","voertuigsoort","merk","handelsbenaming","vervaldatum_apk","datum_tenaamstelling","bruto_bpm","inrichting","aantal_zitplaatsen","eerste_kleur","tweede_kleur","aantal_cilinders","cilinderinhoud","massa_ledig_voertuig","toegestane_maximum_massa_voertuig","massa_rijklaar","maximum_massa_trekken_ongeremd","maximum_trekken_massa_geremd","datum_eerste_toelating","datum_eerste_tenaamstelling_in_nederland","wacht_op_keuren","catalogusprijs","wam_verzekerd","maximale_constructiesnelheid","laadvermogen","oplegger_geremd","aanhangwagen_autonoom_geremd","aanhangwagen_middenas_geremd","aantal_staanplaatsen","aantal_deuren","aantal_wielen","afstand_hart_koppeling_tot_achterzijde_voertuig","afstand_voorzijde_voertuig_tot_hart_koppeling","afwijkende_maximum_snelheid","lengte","breedte","europese_voertuigcategorie","europese_voertuigcategorie_toevoeging","europese_uitvoeringcategorie_toevoeging","plaats_chassisnummer","technische_max_massa_voertuig","type","type_gasinstallatie","typegoedkeuringsnummer","variant","uitvoering","volgnummer_wijziging_eu_typegoedkeuring","vermogen_massarijklaar","wielbasis","export_indicator","openstaande_terugroepactie_indicator","vervaldatum_tachograaf","taxi_indicator","maximum_massa_samenstelling","aantal_rolstoelplaatsen","maximum_ondersteunende_snelheid","jaar_laatste_registratie_tellerstand","tellerstandoordeel","code_toelichting_tellerstandoordeel","tenaamstellen_mogelijk","vervaldatum_apk_dt","datum_tenaamstelling_dt","datum_eerste_toelating_dt","datum_eerste_tenaamstelling_in_nederland_dt","vervaldatum_tachograaf_dt","maximum_last_onder_de_vooras_sen_tezamen_koppeling","type_remsysteem_voertuig_code","rupsonderstelconfiguratiecode","wielbasis_voertuig_minimum","wielbasis_voertuig_maximum","lengte_voertuig_minimum","lengte_voertuig_maximum","breedte_voertuig_minimum","breedte_voertuig_maximum","hoogte_voertuig","hoogte_voertuig_minimum","hoogte_voertuig_maximum","massa_bedrijfsklaar_minimaal","massa_bedrijfsklaar_maximaal","technisch_toelaatbaar_massa_koppelpunt","maximum_massa_technisch_maximaal","maximum_massa_technisch_minimaal","subcategorie_nederland","verticale_belasting_koppelpunt_getrokken_voertuig","zuinigheidsclassificatie","registratie_datum_goedkeuring_afschrijvingsmoment_bpm","registratie_datum_goedkeuring_afschrijvingsmoment_bpm_dt","gem_lading_wrde","aerodyn_voorz","massa_alt_aandr","verl_cab_ind","api_gekentekende_voertuigen_assen","api_gekentekende_voertuigen_brandstof","api_gekentekende_voertuigen_carrosserie","api_gekentekende_voertuigen_carrosserie_specifiek","api_gekentekende_voertuigen_voertuigklasse"
"6ZNN96","Personenauto","BMW","420D XDRIVE","20250513","20240222","10197","sedan","5","GRIJS","Niet geregistreerd","4","1995","1575","2160","1675","750","1600","20150206","20150206","Geen verstrekking in Open Data","79386","Ja",,,,,,,"4","4","0","0",,"464","0","M1",,,"r. schroefveerkoker","2160","3C",,"e1*2007/46*0316*10","4B71","6A250000","0","0.08","281","Ja","Nee",,"Nee","3835","0",,"2024","Logisch","00","Nee","2025-05-13T00:00:00.000","2024-02-22T00:00:00.000","2015-02-06T00:00:00.000","2015-02-06T00:00:00.000",,,,,,,,,,,,,,,,,,,,,"D",,,,,,,"https://opendata.rdw.nl/resource/3huj-srit.json","https://opendata.rdw.nl/resource/8ys7-d773.json","https://opendata.rdw.nl/resource/vezc-m2t6.json","https://opendata.rdw.nl/resource/jhie-znh9.json","https://opendata.rdw.nl/resource/kmfi-hrps.json"
"7ZLX86","Personenauto","BMW","420D XDRIVE","20240520",,"7014","sedan","5","ZWART","Niet geregistreerd","4","1995","1575","2160","1675","750","1600","20140912","20150401","Geen verstrekking in Open Data","74102","Nee",,,,,,,"4","4","0","0",,"464","0","M1",,,"r. schroefveerkoker","2160","3C",,"e1*2007/46*0316*11","4B71","6A250000","0","0.08","281","Ja","Nee",,"Nee","3835","0",,"2024","Geen oordeel","05","Nee","2024-05-20T00:00:00.000",,"2014-09-12T00:00:00.000","2015-04-01T00:00:00.000",,,,,,,,,,,,,,,,,,,,,"D",,,,,,,"https://opendata.rdw.nl/resource/3huj-srit.json","https://opendata.rdw.nl/resource/8ys7-d773.json","https://opendata.rdw.nl/resource/vezc-m2t6.json","https://opendata.rdw.nl/resource/jhie-znh9.json","https://opendata.rdw.nl/resource/kmfi-hrps.json"
"G484ZK","Personenauto","BMW","420D XDRIVE","20230816",,"6038","sedan","5","ZWART","Niet geregistreerd","4","1995","1590","2175","1690","750","1600","20170816","20191220","Geen verstrekking in Open Data","70890","Nee","230",,,,,,"4","4","0","0",,"464","183","M1",,,,"2175","3C",,"e1*2007/46*0316*16","4F11","6A250000","0","0.08","281","Ja","Nee",,"Nee","3850","0","0.00","2023","Geen oordeel","05","Nee","2023-08-16T00:00:00.000",,"2017-08-16T00:00:00.000","2019-12-20T00:00:00.000",,,,,,,,,,,"140",,,,,,,,,,"E",,,,,,,"https://opendata.rdw.nl/resource/3huj-srit.json","https://opendata.rdw.nl/resource/8ys7-d773.json","https://opendata.rdw.nl/resource/vezc-m2t6.json","https://opendata.rdw.nl/resource/jhie-znh9.json","https://opendata.rdw.nl/resource/kmfi-hrps.json"
"GH831G","Personenauto","BMW","420D XDRIVE","20240117",,"7541","sedan","5","ZWART","Niet geregistreerd","4","1995","1575","2160","1675","750","1600","20150107","20150725","Geen verstrekking in Open Data","72422","Nee",,,,,,,"4","4","0","0",,"464","0","M1",,,"r. schroefveerkoker","2160","3C",,"e1*2007/46*0316*10","4B71","6A250000","0","0.08","281","Ja","Ja",,"Nee","3835","0",,"2023","Geen oordeel","05","Nee","2024-01-17T00:00:00.000",,"2015-01-07T00:00:00.000","2015-07-25T00:00:00.000",,,,,,,,,,,,,,,,,,,,,"D",,,,,,,"https://opendata.rdw.nl/resource/3huj-srit.json","https://opendata.rdw.nl/resource/8ys7-d773.json","https://opendata.rdw.nl/resource/vezc-m2t6.json","https://opendata.rdw.nl/resource/jhie-znh9.json","https://opendata.rdw.nl/resource/kmfi-hrps.json"
"GL294X","Personenauto","BMW","420D XDRIVE","20230330",,"10197","sedan","5","GRIJS","Niet geregistreerd","4","1995","1575","2160","1675","750","1600","20150701","20150701","Geen verstrekking in Open Data","78760","Nee",,,,,,,"4","4","0","0",,"464","0","M1",,,"r. schroefveerkoker","2160","3C",,"e1*2007/46*0316*10","4B71","6A250000","0","0.08","281","Ja","Nee",,"Nee","3835","0",,"2022","Logisch","00","Nee","2023-03-30T00:00:00.000",,"2015-07-01T00:00:00.000","2015-07-01T00:00:00.000",,,,,,,,,,,,,,,,,,,,,"D",,,,,,,"https://opendata.rdw.nl/resource/3huj-srit.json","https://opendata.rdw.nl/resource/8ys7-d773.json","https://opendata.rdw.nl/resource/vezc-m2t6.json","https://opendata.rdw.nl/resource/jhie-znh9.json","https://opendata.rdw.nl/resource/kmfi-hrps.json"
"GZ940V","Personenauto","BMW","420D XDRIVE","20221107",,"6644","coupe","4","ZWART","Niet geregistreerd","4","1995","1515","2060","1615","750","1600","20141029","20150923","Geen verstrekking in Open Data","70189","Nee",,,,,,,"2","4","0","0",,"464","0","M1",,,"r. schroefveerkoker","2060","3C",,"e1*2007/46*0316*11","3P31","6A140000","0","0.08","281","Ja","Nee",,"Nee","3735","0",,"2022","Geen oordeel","05","Nee","2022-11-07T00:00:00.000",,"2014-10-29T00:00:00.000","2015-09-23T00:00:00.000",,,,,,,,,,,,,,,,,,,,,"D",,,,,,,"https://opendata.rdw.nl/resource/3huj-srit.json","https://opendata.rdw.nl/resource/8ys7-d773.json","https://opendata.rdw.nl/resource/vezc-m2t6.json","https://opendata.rdw.nl/resource/jhie-znh9.json","https://opendata.rdw.nl/resource/kmfi-hrps.json"
"H717LX","Personenauto","BMW","420D XDRIVE","20230713",,"4570","coupe","5","WIT","Niet geregistreerd","4","1995","1570","2155","1670","750","1600","20150810","20210714","Geen verstrekking in Open Data","70065","Nee","234",,,,,,"4","4",,,,,,"M1",,,"r. motorruimte","2155","3C",,,,,,"0.08","282","Ja","Ja",,"Nee",,,,"2022","Geen oordeel","05","Nee","2023-07-13T00:00:00.000",,"2015-08-10T00:00:00.000","2021-07-14T00:00:00.000",,,,,,,,,,,,,,,,,,,,,,,,,,,,"https://opendata.rdw.nl/resource/3huj-srit.json","https://opendata.rdw.nl/resource/8ys7-d773.json","https://opendata.rdw.nl/resource/vezc-m2t6.json","https://opendata.rdw.nl/resource/jhie-znh9.json","https://opendata.rdw.nl/resource/kmfi-hrps.json"
"J448LZ","Personenauto","BMW","420D XDRIVE","20240926",,"1991","sedan","5","ZWART","Niet geregistreerd","4","1995","1590","2175","1690","750","1600","20160217","20200911","Geen verstrekking in Open Data","67038","Nee","230",,,,,,"4","4","0","0",,"464","183","M1",,,,"2175","3C",,"e1*2007/46*0316*14","4F11","6A250000","0","0.08","281","Ja","Nee",,"Nee","3850","0","0.00","2024","Geen oordeel","05","Nee","2024-09-26T00:00:00.000",,"2016-02-17T00:00:00.000","2020-09-11T00:00:00.000",,,,,,,,,,,"140",,,,,,,,,,"E",,,,,,,"https://opendata.rdw.nl/resource/3huj-srit.json","https://opendata.rdw.nl/resource/8ys7-d773.json","https://opendata.rdw.nl/resource/vezc-m2t6.json","https://opendata.rdw.nl/resource/jhie-znh9.json","https://opendata.rdw.nl/resource/kmfi-hrps.json"
"J976PH","Personenauto","BMW","420D XDRIVE","20240925",,"13902","sedan","5","GRIJS","Niet geregistreerd","4","1995","1635","2220","1735","750","1600","20200925","20200925","Geen verstrekking in Open Data","71645","Nee","230",,,,,,"4","4","0","0",,"464","183","M1",,,,"2220","3C",,"e1*2007/46*0316*23","4K51","DAW507B0","0","0.08","281","Ja","Nee",,"Nee","3820","0","0.00","2023","Logisch","00","Nee","2024-09-25T00:00:00.000",,"2020-09-25T00:00:00.000","2020-09-25T00:00:00.000",,,,,,,,,,,"140",,,,,,,,,,"E",,,,,,,"https://opendata.rdw.nl/resource/3huj-srit.json","https://opendata.rdw.nl/resource/8ys7-d773.json","https://opendata.rdw.nl/resource/vezc-m2t6.json","https://opendata.rdw.nl/resource/jhie-znh9.json","https://opendata.rdw.nl/resource/kmfi-hrps.json"
"JD055L","Personenauto","BMW","420D XDRIVE","20231030",,"7524","sedan","5","ZWART","Niet geregistreerd","4","1995","1575","2160","1675","750","1600","20150115","20160217","Geen verstrekking in Open Data","76009","Nee",,,,,,,"4","4","0","0",,"464","0","M1",,,"r. motorruimte","2160","3C",,"e1*2007/46*0316*11","4B71","6A250000","0","0.08","281","Ja","Nee",,"Nee","3835","0",,"2023","Geen oordeel","05","Nee","2023-10-30T00:00:00.000",,"2015-01-15T00:00:00.000","2016-02-17T00:00:00.000",,,,,,,,,,,,,,,,,,,,,"D",,,,,,,"https://opendata.rdw.nl/resource/3huj-srit.json","https://opendata.rdw.nl/resource/8ys7-d773.json","https://opendata.rdw.nl/resource/vezc-m2t6.json","https://opendata.rdw.nl/resource/jhie-znh9.json","https://opendata.rdw.nl/resource/kmfi-hrps.json"
"JD154B","Personenauto","BMW","420D XDRIVE","20240619",,"8013","sedan","5","WIT","Niet geregistreerd","4","1995","1590","2175","1690","750","1600","20150619","20160211","Geen verstrekking in Open Data","72853","Nee",,,,,,,"4","4",,,,,,"M1",,,"r. schroefveerkoker","2175","3C",,,,,,"0.08","281","Ja","Nee",,"Nee","3850",,,"2023","Geen oordeel","05","Nee","2024-06-19T00:00:00.000",,"2015-06-19T00:00:00.000","2016-02-11T00:00:00.000",,,,,,,,,,,,,,,,,,,,,"D",,,,,,,"https://opendata.rdw.nl/resource/3huj-srit.json","https://opendata.rdw.nl/resource/8ys7-d773.json","https://opendata.rdw.nl/resource/vezc-m2t6.json","https://opendata.rdw.nl/resource/jhie-znh9.json","https://opendata.rdw.nl/resource/kmfi-hrps.json"
"JG447L","Personenauto","BMW","420D XDRIVE","20230625",,"6756","sedan","5","BLAUW","Niet geregistreerd","4","1995","1590","2175","1690","750","1600","20150806","20160331","Geen verstrekking in Open Data","70740","Nee",,,,,,,"4","4","0","0",,"464","0","M1",,,"r. motorruimte","2175","3C",,"e1*2007/46*0316*14","4F11","6A250000","0","0.08","281","Ja","Nee",,"Nee","3850","0","0.00","2023","Geen oordeel","05","Nee","2023-06-25T00:00:00.000",,"2015-08-06T00:00:00.000","2016-03-31T00:00:00.000",,,,,,,,,,,,,,,,,,,,,"D",,,,,,,"https://opendata.rdw.nl/resource/3huj-srit.json","https://opendata.rdw.nl/resource/8ys7-d773.json","https://opendata.rdw.nl/resource/vezc-m2t6.json","https://opendata.rdw.nl/resource/jhie-znh9.json","https://opendata.rdw.nl/resource/kmfi-hrps.json"
"K721PP","Personenauto","BMW","420D XDRIVE","20240330",,"2523","sedan","5","BLAUW","Niet geregistreerd","4","1995","1590","2175","1690","750","1600","20151118","20210222","Geen verstrekking in Open Data","68080","Nee","230",,,,,,"4","4","0","0",,"464","183","M1",,,"r. schroefveerkoker","2175","3C",,"e1*2007/46*0316*14","4F11","6A250000","0","0.08","281","Ja","Ja",,"Nee","3850","0","0.00","2023","Geen oordeel","05","Nee","2024-03-30T00:00:00.000",,"2015-11-18T00:00:00.000","2021-02-22T00:00:00.000",,,,,,,,,,,"140",,,,,,,,,,"D",,,,,,,"https://opendata.rdw.nl/resource/3huj-srit.json","https://opendata.rdw.nl/resource/8ys7-d773.json","https://opendata.rdw.nl/resource/vezc-m2t6.json","https://opendata.rdw.nl/resource/jhie-znh9.json","https://opendata.rdw.nl/resource/kmfi-hrps.json"
"KD803J","Personenauto","BMW","420D XDRIVE","20240222",,"7442","sedan","5","BRUIN","Niet geregistreerd","4","1995","1590","2175","1690","750","1600","20160210","20160730","Geen verstrekking in Open Data","67611","Nee",,,,,,,"4","4","0","0",,"464","0","M1",,,"r. motorruimte","2175","3C",,"e1*2007/46*0316*14","4F11","6A250700","0","0.08","281","Ja","Nee",,"Nee","3850","0","0.00","2023","Geen oordeel","05","Nee","2024-02-22T00:00:00.000",,"2016-02-10T00:00:00.000","2016-07-30T00:00:00.000",,,,,,,,,,,,,,,,,,,,,"E",,,,,,,"https://opendata.rdw.nl/resource/3huj-srit.json","https://opendata.rdw.nl/resource/8ys7-d773.json","https://opendata.rdw.nl/resource/vezc-m2t6.json","https://opendata.rdw.nl/resource/jhie-znh9.json","https://opendata.rdw.nl/resource/kmfi-hrps.json"
"KD995H","Personenauto","BMW","420D XDRIVE","20231212",,"9880","coupe","4","ZWART","Niet geregistreerd","4","1995","1535","2080","1635","750","1600","20160803","20160803","Geen verstrekking in Open Data","68683","Nee",,,,,,,"2","4","0","0",,"464","183","M1",,,"in motorruimte r.","2080","3C",,"e1*2007/46*0316*16","4P91","6A240000","0","0.09","281","Ja","Nee",,"Nee","3755","0","0.00","2023","Logisch","00","Nee","2023-12-12T00:00:00.000",,"2016-08-03T00:00:00.000","2016-08-03T00:00:00.000",,,,,,,,,,,"139",,,,,,,,,,"E",,,,,,,"https://opendata.rdw.nl/resource/3huj-srit.json","https://opendata.rdw.nl/resource/8ys7-d773.json","https://opendata.rdw.nl/resource/vezc-m2t6.json","https://opendata.rdw.nl/resource/jhie-znh9.json","https://opendata.rdw.nl/resource/kmfi-hrps.json"
"KH476P","Personenauto","BMW","420D XDRIVE","20240831","20240418","7387","sedan","5","BRUIN","Niet geregistreerd","4","1995","1590","2175","1690","750","1600","20150831","20160912","Geen verstrekking in Open Data","71789","Ja",,,,,,,"4","4","0","0",,"464","0","M1",,,"r. schroefveerkoker","2175","3C",,"e1*2007/46*0316*14","4F11","6A250000","0","0.08","281","Ja","Ja",,"Nee","3850","0","0.00","2024","Geen oordeel","05","Nee","2024-08-31T00:00:00.000","2024-04-18T00:00:00.000","2015-08-31T00:00:00.000","2016-09-12T00:00:00.000",,,,,,,,,,,,,,,,,,,,,"D",,,,,,,"https://opendata.rdw.nl/resource/3huj-srit.json","https://opendata.rdw.nl/resource/8ys7-d773.json","https://opendata.rdw.nl/resource/vezc-m2t6.json","https://opendata.rdw.nl/resource/jhie-znh9.json","https://opendata.rdw.nl/resource/kmfi-hrps.json"
"KH943Z","Personenauto","BMW","420D XDRIVE","20231029",,"6302","sedan","5","WIT","Niet geregistreerd","4","1995","1590","2175","1690","750","1600","20151029","20160913","Geen verstrekking in Open Data","66191","Nee",,,,,,,"4","4","0","0",,"464","0","M1",,,"r. schroefveerkoker","2175","3C",,"e1*2007/46*0316*14","4F11","6A150000","0","0.08","281","Ja","Nee",,"Nee","3850","0","0.00","2023","Geen oordeel","05","Nee","2023-10-29T00:00:00.000",,"2015-10-29T00:00:00.000","2016-09-13T00:00:00.000",,,,,,,,,,,,,,,,,,,,,"C",,,,,,,"https://opendata.rdw.nl/resource/3huj-srit.json","https://opendata.rdw.nl/resource/8ys7-d773.json","https://opendata.rdw.nl/resource/vezc-m2t6.json","https://opendata.rdw.nl/resource/jhie-znh9.json","https://opendata.rdw.nl/resource/kmfi-hrps.json"
"KR588X","Personenauto","BMW","420D XDRIVE","20230822",,"4705","sedan","5","ZWART","Niet geregistreerd","4","1995","1590","2175","1690","750","1600","20151231","20170708","Geen verstrekking in Open Data","73880","Nee",,,,,,,"4","4","0","0",,"464","0","M1",,,"r. schroefveerkoker","2175","3C",,"e1*2007/46*0316*14","4F11","6A250000","0","0.08","281","Ja","Ja",,"Nee","3850","0","0.00","2023","Geen oordeel","05","Nee","2023-08-22T00:00:00.000",,"2015-12-31T00:00:00.000","2017-07-08T00:00:00.000",,,,,,,,,,,,,,,,,,,,,"D",,,,,,,"https://opendata.rdw.nl/resource/3huj-srit.json","https://opendata.rdw.nl/resource/8ys7-d773.json","https://opendata.rdw.nl/resource/vezc-m2t6.json","https://opendata.rdw.nl/resource/jhie-znh9.json","https://opendata.rdw.nl/resource/kmfi-hrps.json"
"KZ984H","Personenauto","BMW","420D XDRIVE","20230110",,"8407","sedan","5","BRUIN","Niet geregistreerd","4","1995","1590","2175","1690","750","1600","20170110","20170110","Geen verstrekking in Open Data","62640","Nee",,,,,,,"4","4","0","0",,"464","183","M1",,,"in motorruimte r.","2175","3C",,"e1*2007/46*0316*16","4F11","6A150000","0","0.08","281","Ja","Nee",,"Nee","3850","0","0.00","2022","Logisch","00","Nee","2023-01-10T00:00:00.000",,"2017-01-10T00:00:00.000","2017-01-10T00:00:00.000",,,,,,,,,,,"140",,,,,,,,,,"E",,,,,,,"https://opendata.rdw.nl/resource/3huj-srit.json","https://opendata.rdw.nl/resource/8ys7-d773.json","https://opendata.rdw.nl/resource/vezc-m2t6.json","https://opendata.rdw.nl/resource/jhie-znh9.json","https://opendata.rdw.nl/resource/kmfi-hrps.json"
"L098RV","Personenauto","BMW","420D XDRIVE","20240720",,"2074","sedan","5","GRIJS","Niet geregistreerd","4","1995","1590","2175","1690","750","1600","20170224","20210713","Geen verstrekking in Open Data","57966","Nee","230",,,,,,"4","4",,,,"464","183","M1",,,"r. schroefveerkoker","2175","3C",,,,,,"0.08","281","Ja","Nee",,"Nee","3850",,,"2023","Onlogisch","04","Nee","2024-07-20T00:00:00.000",,"2017-02-24T00:00:00.000","2021-07-13T00:00:00.000",,,,,,,,,,,"140",,,,,,,,,,,,,,,,,"https://opendata.rdw.nl/resource/3huj-srit.json","https://opendata.rdw.nl/resource/8ys7-d773.json","https://opendata.rdw.nl/resource/vezc-m2t6.json","https://opendata.rdw.nl/resource/jhie-znh9.json","https://opendata.rdw.nl/resource/kmfi-hrps.json"
"L106DF","Personenauto","BMW","420D XDRIVE","20230505",,"8912","coupe","4","BLAUW","Niet geregistreerd","4","1995","1515","1985","1615","750","1600","20140324","20210419","Geen verstrekking in Open Data","69412","Nee","229",,,,,,"2","4","0","0",,"464","183","M1",,,,"1985","3C",,"e1*2007/46*0316*09","3P31","6A240000","0","0.08","281","Ja","Ja",,"Nee","3660","0","0.00","2022","Geen oordeel","05","Nee","2023-05-05T00:00:00.000",,"2014-03-24T00:00:00.000","2021-04-19T00:00:00.000",,,,,,,,,,,"139",,,,,,,,,,,,,,,,,"https://opendata.rdw.nl/resource/3huj-srit.json","https://opendata.rdw.nl/resource/8ys7-d773.json","https://opendata.rdw.nl/resource/vezc-m2t6.json","https://opendata.rdw.nl/resource/jhie-znh9.json","https://opendata.rdw.nl/resource/kmfi-hrps.json"
"L387NZ","Personenauto","BMW","420D XDRIVE","20220629",,"484","sedan","5","ZWART","Niet geregistreerd","4","1995","1635","2220","1735","750","1600","20180528","20210628","Geen verstrekking in Open Data","71042","Nee","230",,,,,,"4","4",,,,"464","183","M1",,,,"2220","3C",,"e1*2007/46*0316*20","4K51","6AW500L0","0","0.08","281","Ja","Nee",,"Nee","3820",,,"2022","Geen oordeel","05","Nee","2022-06-29T00:00:00.000",,"2018-05-28T00:00:00.000","2021-06-28T00:00:00.000",,,,,,,,,,,"140",,,,,,,,,,,,,,,,,"https://opendata.rdw.nl/resource/3huj-srit.json","https://opendata.rdw.nl/resource/8ys7-d773.json","https://opendata.rdw.nl/resource/vezc-m2t6.json","https://opendata.rdw.nl/resource/jhie-znh9.json","https://opendata.rdw.nl/resource/kmfi-hrps.json"
"L943RR","Personenauto","BMW","420D XDRIVE","20231220",,"6063","sedan","5","BRUIN","Niet geregistreerd","4","1995","1590","2175","1690","750","1600","20160909","20211220","Geen verstrekking in Open Data","75490","Nee","230",,,,,,"4","4","0","0",,"464","183","M1",,,,"2175","3C",,"e1*2007/46*0316*16","4F11","6A250000","0","0.08","281","Ja","Nee",,"Nee","3850","0","0.00","2023","Geen oordeel","05","Nee","2023-12-20T00:00:00.000",,"2016-09-09T00:00:00.000","2021-12-20T00:00:00.000",,,,,,,,,,,"140",,,,,,,,,,,,,,,,,"https://opendata.rdw.nl/resource/3huj-srit.json","https://opendata.rdw.nl/resource/8ys7-d773.json","https://opendata.rdw.nl/resource/vezc-m2t6.json","https://opendata.rdw.nl/resource/jhie-znh9.json","https://opendata.rdw.nl/resource/kmfi-hrps.json"
"NZ510K","Personenauto","BMW","420D XDRIVE","20240219",,"6630","sedan","5","ZWART","Niet geregistreerd","4","1995","1590","2175","1690","750","1600","20150810","20170815","Geen verstrekking in Open Data","64402","Nee",,,,,,,"4","4","0","0",,"464","0","M1",,,"r. motorruimte","2175","3C",,"e1*2007/46*0316*14","4F11","6A250000","0","0.08","281","Ja","Ja",,"Nee","3850","0","0.00","2024","Geen oordeel","05","Nee","2024-02-19T00:00:00.000",,"2015-08-10T00:00:00.000","2017-08-15T00:00:00.000",,,,,,,,,,,,,,,,,,,,,"D",,,,,,,"https://opendata.rdw.nl/resource/3huj-srit.json","https://opendata.rdw.nl/resource/8ys7-d773.json","https://opendata.rdw.nl/resource/vezc-m2t6.json","https://opendata.rdw.nl/resource/jhie-znh9.json","https://opendata.rdw.nl/resource/kmfi-hrps.json"
"PK880G","Personenauto","BMW","420D XDRIVE","20221129",,"8474","sedan","5","ZWART","Niet geregistreerd","4","1995","1590","2175","1690","750","1600","20161129","20170710","Geen verstrekking in Open Data","72458","Nee",,,,,,,"4","4","0","0",,"464","0","M1",,,"r. schroefveerkoker","2175","3C",,"e1*2007/46*0316*16","4F11","6A250000","0","0.08","281","Ja","Nee",,"Nee","3850","0","0.00","2021","Geen oordeel","05","Nee","2022-11-29T00:00:00.000",,"2016-11-29T00:00:00.000","2017-07-10T00:00:00.000",,,,,,,,,,,,,,,,,,,,,"E",,,,,,,"https://opendata.rdw.nl/resource/3huj-srit.json","https://opendata.rdw.nl/resource/8ys7-d773.json","https://opendata.rdw.nl/resource/vezc-m2t6.json","https://opendata.rdw.nl/resource/jhie-znh9.json","https://opendata.rdw.nl/resource/kmfi-hrps.json"
"PV588G","Personenauto","BMW","420D XDRIVE","20240310",,"10989","sedan","5","ZWART","Niet geregistreerd","4","1995","1590","2175","1690","750","1600","20160217","20170921","Geen verstrekking in Open Data","81967","Nee",,,,,,,"4","4","0","0",,"464","0","M1",,,"r. schroefveerkoker","2175","3C",,"e1*2007/46*0316*14","4F11","6A250000","0","0.08","281","Ja","Nee",,"Nee","3850","0","0.00","2024","Geen oordeel","05","Nee","2024-03-10T00:00:00.000",,"2016-02-17T00:00:00.000","2017-09-21T00:00:00.000",,,,,,,,,,,,,,,,,,,,,"E",,,,,,,"https://opendata.rdw.nl/resource/3huj-srit.json","https://opendata.rdw.nl/resource/8ys7-d773.json","https://opendata.rdw.nl/resource/vezc-m2t6.json","https://opendata.rdw.nl/resource/jhie-znh9.json","https://opendata.rdw.nl/resource/kmfi-hrps.json"
"PZ733T","Personenauto","BMW","420D XDRIVE","20230128",,"4987","sedan","5","GRIJS","Niet geregistreerd","4","1995","1575","2160","1675","750","1600","20140728","20190122","Geen verstrekking in Open Data","60007","Nee",,,,,,,"4","4","0","0",,"464","0","M1",,,"r. schroefveerkoker","2160","3C",,"e1*2007/46*0316*11","4B71","6A150000","0","0.08","281","Ja","Nee",,"Nee","3835","0",,"2022","Geen oordeel","05","Nee","2023-01-28T00:00:00.000",,"2014-07-28T00:00:00.000","2019-01-22T00:00:00.000",,,,,,,,,,,,,,,,,,,,,"D",,,,,,,"https://opendata.rdw.nl/resource/3huj-srit.json","https://opendata.rdw.nl/resource/8ys7-d773.json","https://opendata.rdw.nl/resource/vezc-m2t6.json","https://opendata.rdw.nl/resource/jhie-znh9.json","https://opendata.rdw.nl/resource/kmfi-hrps.json"