"kenteken","voertuigsoort","merk","handelsbenaming","vervaldatum_apk","datum_tenaamstelling","bruto_bpm","inrichting","aantal_zitplaatsen","eerste_kleur","tweede_kleur","aantal_cilinders","cilinderinhoud","massa_ledig_voertuig","toegestane_maximum_massa_voertuig","massa_rijklaar","maximum_massa_trekken_ongeremd","maximum_trekken_massa_geremd","datum_eerste_toelating","datum_eerste_tenaamstelling_in_nederland","wacht_op_keuren","catalogusprijs","wam_verzekerd","maximale_constructiesnelheid","laadvermogen","oplegger_geremd","aanhangwagen_autonoom_geremd","aanhangwagen_middenas_geremd","aantal_staanplaatsen","aantal_deuren","aantal_wielen","afstand_hart_koppeling_tot_achterzijde_voertuig","afstand_voorzijde_voertuig_tot_hart_koppeling","afwijkende_maximum_snelheid","lengte","breedte","europese_voertuigcategorie","europese_voertuigcategorie_toevoeging","europese_uitvoeringcategorie_toevoeging","plaats_chassisnummer","technische_max_massa_voertuig","type","type_gasinstallatie","typegoedkeuringsnummer","variant","uitvoering","volgnummer_wijziging_eu_typegoedkeuring","vermogen_massarijklaar","wielbasis","export_indicator","openstaande_terugroepactie_indicator","vervaldatum_tachograaf","taxi_indicator","maximum_massa_samenstelling","aantal_rolstoelplaatsen","maximum_ondersteunende_snelheid","jaar_laatste_registratie_tellerstand","tellerstandoordeel","code_toelichting_tellerstandoordeel","tenaamstellen_mogelijk","vervaldatum_apk_dt","datum_tenaamstelling_dt","datum_eerste_toelating_dt","datum_eerste_tenaamstelling_in_nederland_dt","vervaldatum_tachograaf_dt","maximum_last_onder_de_vooras_sen_tezamen_koppeling","type_remsysteem_voertuig_code","rupsonderstelconfiguratiecode","wielbasis_voertuig_minimum","wielbasis_voertuig_maximum","lengte_voertuig_minimum","lengte_voertuig_maximum","breedte_voertuig_minimum","breedte_voertuig_maximum","hoogte_voertuig","hoogte_voertuig_minimum","hoogte_voertuig_maximum","massa_bedrijfsklaar_minimaal","massa_bedrijfsklaar_maximaal","technisch_toelaatbaar_massa_koppelpunt","maximum_massa_technisch_maximaal","maximum_massa_technisch_minimaal","subcategorie_nederland","verticale_belasting_koppelpunt_getrokken_voertuig","zuinigheidsclassificatie","registratie_datum_goedkeuring_afschrijvingsmoment_bpm","registratie_datum_goedkeuring_afschrijvingsmoment_bpm_dt","gem_lading_wrde","aerodyn_voorz","massa_alt_aandr","verl_cab_ind","api_gekentekende_voertuigen_assen","api_gekentekende_voertuigen_brandstof","api_gekentekende_voertuigen_carrosserie","api_gekentekende_voertuigen_carrosserie_specifiek","api_gekentekende_voertuigen_voertuigklasse"
"J976LJ","Personenauto","BMW","225XE IPERFORMANCE","20231102",,"468","stationwagen","5","WIT","Niet geregistreerd","3","1499","1635","2180","1735",,,"20161027","20200901","Geen verstrekking in Open Data","46337","Nee","202",,,,,,"4","4","0","0",,"434","180","M1",,,,"2180","UKL-L",,"e1*2007/46*0371*24","2C71","6A2500C0","0","0.02","267","Ja","Nee",,"Nee","0","0","0.00","2024","Geen oordeel","05","Nee","2023-11-02T00:00:00.000",,"2016-10-27T00:00:00.000","2020-09-01T00:00:00.000",,,,,,,,,,,"156",,,,,,,,,,"A",,,,,,,"https://opendata.rdw.nl/resource/3huj-srit.json","https://opendata.rdw.nl/resource/8ys7-d773.json","https://opendata.rdw.nl/resource/vezc-m2t6.json","https://opendata.rdw.nl/resource/jhie-znh9.json","https://opendata.rdw.nl/resource/kmfi-hrps.json"
"KH131T","Personenauto","BMW","225XE IPERFORMANCE","20240117",,"451","stationwagen","5","ZWART","Niet geregistreerd","3","1499","1635","2180","1735",,,"20160922","20160922","Geen verstrekking in Open Data","44256","Nee",,,,,,,"4","4","0","0",,"434","180","M1",,,"in motorruimte r.","2180","UKL-L",,"e1*2007/46*0371*24","2C71","6A1500C0","0","0.06","267","Ja","Nee",,"Nee","0","0","0.00","2022","Logisch","00","Nee","2024-01-17T00:00:00.000",,"2016-09-22T00:00:00.000","2016-09-22T00:00:00.000",,,,,,,,,,,"156",,,,,,,,,,"A",,,,,,,"https://opendata.rdw.nl/resource/3huj-srit.json","https://opendata.rdw.nl/resource/8ys7-d773.json","https://opendata.rdw.nl/resource/vezc-m2t6.json","https://opendata.rdw.nl/resource/jhie-znh9.json","https://opendata.rdw.nl/resource/kmfi-hrps.json"
"KN875Z","Personenauto","BMW","225XE IPERFORMANCE","20241031",,"451","stationwagen","5","GRIJS","Niet geregistreerd","3","1499","1635","2180","1735",,,"20161031","20161031","Geen verstrekking in Open Data","49343","Nee",,,,,,,"4","4","0","0",,"434","180","M1",,,"in motorruimte r.","2180","UKL-L",,"e1*2007/46*0371*24","2C71","6A1500C0","0","0.06","267","Ja","Nee",,"Nee","0","0","0.00","2022","Logisch","00","Nee","2024-10-31T00:00:00.000",,"2016-10-31T00:00:00.000","2016-10-31T00:00:00.000",,,,,,,,,,,"156",,,,,,,,,,"A",,,,,,,"https://opendata.rdw.nl/resource/3huj-srit.json","https://opendata.rdw.nl/resource/8ys7-d773.json","https://opendata.rdw.nl/resource/vezc-m2t6.json","https://opendata.rdw.nl/resource/jhie-znh9.json","https://opendata.rdw.nl/resource/kmfi-hrps.json"
"KP507X","Personenauto","BMW","225XE IPERFORMANCE",,,"451","stationwagen","5","BLAUW","Niet geregistreerd","3","1499","1635","2180","1735",,,"20161104","20161104","Geen verstrekking in Open Data","52579","Nee",,,,,,,"4","4","0","0",,"434","0","M1",,,"in motorruimte r.","2180","UKL-L",,"e1*2007/46*0371*24","2C71","6A1500C0","0","0.06","267","Ja","Nee",,"Nee","0","0","0.00","2022","Logisch","00","Nee",,,"2016-11-04T00:00:00.000","2016-11-04T00:00:00.000",,,,,,,,,,,,,,,,,,,,,"A",,,,,,,"https://opendata.rdw.nl/resource/3huj-srit.json","https://opendata.rdw.nl/resource/8ys7-d773.json","https://opendata.rdw.nl/resource/vezc-m2t6.json","https://opendata.rdw.nl/resource/jhie-znh9.json","https://opendata.rdw.nl/resource/kmfi-hrps.json"
"KR235X","Personenauto","BMW","225XE IPERFORMANCE",,,"451","stationwagen","5","ZWART","Niet geregistreerd","3","1499","1635","2180","1735",,,"20161116","20161116","Geen verstrekking in Open Data","41394","Nee",,,,,,,"4","4","0","0",,"434","0","M1",,,"in motorruimte r.","2180","UKL-L",,"e1*2007/46*0371*24","2C71","6A1500C0","0","0.06","267","Ja","Nee",,"Nee","0","0","0.00","2022","Logisch","00","Nee",,,"2016-11-16T00:00:00.000","2016-11-16T00:00:00.000",,,,,,,,,,,,,,,,,,,,,"A",,,,,,,"https://opendata.rdw.nl/resource/3huj-srit.json","https://opendata.rdw.nl/resource/8ys7-d773.json","https://opendata.rdw.nl/resource/vezc-m2t6.json","https://opendata.rdw.nl/resource/jhie-znh9.json","https://opendata.rdw.nl/resource/kmfi-hrps.json"
"KR245J","Personenauto","BMW","225XE IPERFORMANCE",,,"451","stationwagen","5","GRIJS","Niet geregistreerd","3","1499","1635","2180","1735",,,"20161104","20161104","Geen verstrekking in Open Data","44255","Nee",,,,,,,"4","4","0","0",,"434","0","M1",,,"in motorruimte r.","2180","UKL-L",,"e1*2007/46*0371*24","2C71","6A1500C0","0","0.06","267","Ja","Nee",,"Nee","0","0","0.00","2022","Logisch","00","Nee",,,"2016-11-04T00:00:00.000","2016-11-04T00:00:00.000",,,,,,,,,,,,,,,,,,,,,"A",,,,,,,"https://opendata.rdw.nl/resource/3huj-srit.json","https://opendata.rdw.nl/resource/8ys7-d773.json","https://opendata.rdw.nl/resource/vezc-m2t6.json","https://opendata.rdw.nl/resource/jhie-znh9.json","https://opendata.rdw.nl/resource/kmfi-hrps.json"
"KR967K","Personenauto","BMW","225XE IPERFORMANCE","20241212",,"451","stationwagen","5","GRIJS","Niet geregistreerd","3","1499","1635","2180","1735",,,"20161109","20161109","Geen verstrekking in Open Data","49478","Nee",,,,,,,"4","4","0","0",,"434","180","M1",,,"in motorruimte r.","2180","UKL-L",,"e1*2007/46*0371*24","2C71","6A1500C0","0","0.06","267","Ja","Nee",,"Nee","0","0","0.00","2022","Logisch","00","Nee","2024-12-12T00:00:00.000",,"2016-11-09T00:00:00.000","2016-11-09T00:00:00.000",,,,,,,,,,,"156",,,,,,,,,,"A",,,,,,,"https://opendata.rdw.nl/resource/3huj-srit.json","https://opendata.rdw.nl/resource/8ys7-d773.json","https://opendata.rdw.nl/resource/vezc-m2t6.json","https://opendata.rdw.nl/resource/jhie-znh9.json","https://opendata.rdw.nl/resource/kmfi-hrps.json"
"KS306N","Personenauto","BMW","225XE IPERFORMANCE",,,"451","stationwagen","5","GRIJS","Niet geregistreerd","3","1499","1635","2180","1735",,,"20161121","20161121","Geen verstrekking in Open Data","47649","Ja",,,,,,,"4","4","0","0",,"434","0","M1",,,"in motorruimte r.","2180","UKL-L",,"e1*2007/46*0371*24","2C71","6A1500C0","0","0.06","267","Ja","Nee",,"Nee","0","0","0.00","2022","Logisch","00","Nee",,,"2016-11-21T00:00:00.000","2016-11-21T00:00:00.000",,,,,,,,,,,,,,,,,,,,,"A",,,,,,,"https://opendata.rdw.nl/resource/3huj-srit.json","https://opendata.rdw.nl/resource/8ys7-d773.json","https://opendata.rdw.nl/resource/vezc-m2t6.json","https://opendata.rdw.nl/resource/jhie-znh9.json","https://opendata.rdw.nl/resource/kmfi-hrps.json"
"KT277B","Personenauto","BMW","225XE IPERFORMANCE",,,"451","stationwagen","5","ZWART","Niet geregistreerd","3","1499","1635","2180","1735",,,"20161124","20161124","Geen verstrekking in Open Data","47633","Nee",,,,,,,"4","4","0","0",,"434","180","M1",,,"in motorruimte r.","2180","F2AT",,"e1*2007/46*1675*00","2C71","6A1500C0","0","0.06","267","Ja","Nee",,"Nee","0","0","0.00","2022","Logisch","00","Nee",,,"2016-11-24T00:00:00.000","2016-11-24T00:00:00.000",,,,,,,,,,,"156",,,,,,,,,,"A",,,,,,,"https://opendata.rdw.nl/resource/3huj-srit.json","https://opendata.rdw.nl/resource/8ys7-d773.json","https://opendata.rdw.nl/resource/vezc-m2t6.json","https://opendata.rdw.nl/resource/jhie-znh9.json","https://opendata.rdw.nl/resource/kmfi-hrps.json"
"KV543J","Personenauto","BMW","225XE IPERFORMANCE","20241206","20231221","451","stationwagen","5","ZWART","Niet geregistreerd","3","1499","1635","2180","1735",,,"20161206","20161206","Geen verstrekking in Open Data","46867","Ja",,,,,,,"4","4","0","0",,"434","180","M1",,,"in motorruimte r.","2180","UKL-L",,"e1*2007/46*0371*24","2C71","6A1500C0","0","0.06","267","Ja","Nee",,"Nee","0","0","0.00","2024","Logisch","00","Nee","2024-12-06T00:00:00.000","2023-12-21T00:00:00.000","2016-12-06T00:00:00.000","2016-12-06T00:00:00.000",,,,,,,,,,,"156",,,,,,,,,,"A",,,,,,,"https://opendata.rdw.nl/resource/3huj-srit.json","https://opendata.rdw.nl/resource/8ys7-d773.json","https://opendata.rdw.nl/resource/vezc-m2t6.json","https://opendata.rdw.nl/resource/jhie-znh9.json","https://opendata.rdw.nl/resource/kmfi-hrps.json"
"KX113L","Personenauto","BMW","225XE IPERFORMANCE",,,"451","stationwagen","5","BRUIN","Niet geregistreerd","3","1499","1635","2180","1735",,,"20161223","20161223","Geen verstrekking in Open Data","42819","Nee",,,,,,,"4","4","0","0",,"434","0","M1",,,"in motorruimte r.","2180","UKL-L",,"e1*2007/46*0371*24","2C71","6A1500C0","0","0.06","267","Ja","Nee",,"Nee","0","0","0.00","2022","Logisch","00","Nee",,,"2016-12-23T00:00:00.000","2016-12-23T00:00:00.000",,,,,,,,,,,,,,,,,,,,,"A",,,,,,,"https://opendata.rdw.nl/resource/3huj-srit.json","https://opendata.rdw.nl/resource/8ys7-d773.json","https://opendata.rdw.nl/resource/vezc-m2t6.json","https://opendata.rdw.nl/resource/jhie-znh9.json","https://opendata.rdw.nl/resource/kmfi-hrps.json"
"KX125F","Personenauto","BMW","225XE IPERFORMANCE",,,"451","stationwagen","5","ROOD","Niet geregistreerd","3","1499","1635","2180","1735",,,"20161216","20161216","Geen verstrekking in Open Data","50414","Nee",,,,,,,"4","4","0","0",,"434","0","M1",,,"in motorruimte r.","2180","F2AT",,"e1*2007/46*1675*00","2C71","6A1500C0","0","0.06","267","Ja","Nee",,"Nee","0","0","0.00","2022","Logisch","00","Nee",,,"2016-12-16T00:00:00.000","2016-12-16T00:00:00.000",,,,,,,,,,,,,,,,,,,,,"A",,,,,,,"https://opendata.rdw.nl/resource/3huj-srit.json","https://opendata.rdw.nl/resource/8ys7-d773.json","https://opendata.rdw.nl/resource/vezc-m2t6.json","https://opendata.rdw.nl/resource/jhie-znh9.json","https://opendata.rdw.nl/resource/kmfi-hrps.json"
"KX971S","Personenauto","BMW","225XE IPERFORMANCE","20241228",,"451","stationwagen","5","GRIJS","Niet geregistreerd","3","1499","1635","2180","1735",,,"20161228","20161228","Geen verstrekking in Open Data","43715","Nee",,,,,,,"4","4","0","0",,"434","180","M1",,,"in motorruimte r.","2180","F2AT",,"e1*2007/46*1675*00","2C71","6A1500C0","0","0.06","267","Ja","Nee",,"Nee","0","0","0.00","2023","Logisch","00","Nee","2024-12-28T00:00:00.000",,"2016-12-28T00:00:00.000","2016-12-28T00:00:00.000",,,,,,,,,,,"156",,,,,,,,,,"A",,,,,,,"https://opendata.rdw.nl/resource/3huj-srit.json","https://opendata.rdw.nl/resource/8ys7-d773.json","https://opendata.rdw.nl/resource/vezc-m2t6.json","https://opendata.rdw.nl/resource/jhie-znh9.json","https://opendata.rdw.nl/resource/kmfi-hrps.json"
"L272PR","Personenauto","BMW","225XE IPERFORMANCE","20250630",,"2155","stationwagen","5","ZWART","Niet geregistreerd","3","1499","1635","2180","1735",,,"20190220","20210701","Geen verstrekking in Open Data","46437","Nee","202",,,,,,"4","4","0","0",,"435","180","M1",,,,"2180","F2AT",,"e1*2007/46*1675*06","6Y31","DAW50000","0","0.02","267","Ja","Nee",,"Nee","0","0","0.00","2023","Geen oordeel","05","Nee","2025-06-30T00:00:00.000",,"2019-02-20T00:00:00.000","2021-07-01T00:00:00.000",,,,,,,,,,,"156",,,,,,,,,,,,,,,,,"https://opendata.rdw.nl/resource/3huj-srit.json","https://opendata.rdw.nl/resource/8ys7-d773.json","https://opendata.rdw.nl/resource/vezc-m2t6.json","https://opendata.rdw.nl/resource/jhie-znh9.json","https://opendata.rdw.nl/resource/kmfi-hrps.json"
"L934BN","Personenauto","BMW","225XE IPERFORMANCE","20240731",,"1962","stationwagen","5","WIT","Niet geregistreerd","3","1499","1635","2180","1735",,,"20170724","20210430","Geen verstrekking in Open Data","45226","Nee","202",,,,,,"4","4","0","0",,"434","180","M1",,,,"2180","F2AT",,"e1*2007/46*1675*02","2C71","6A1500C0","0","0.02","267","Ja","Nee",,"Nee","0","0","0.00","2022","Geen oordeel","05","Nee","2024-07-31T00:00:00.000",,"2017-07-24T00:00:00.000","2021-04-30T00:00:00.000",,,,,,,,,,,"156",,,,,,,,,,,,,,,,,"https://opendata.rdw.nl/resource/3huj-srit.json","https://opendata.rdw.nl/resource/8ys7-d773.json","https://opendata.rdw.nl/resource/vezc-m2t6.json","https://opendata.rdw.nl/resource/jhie-znh9.json","https://opendata.rdw.nl/resource/kmfi-hrps.json"
"N234HJ","Personenauto","BMW","225XE IPERFORMANCE","20250505",,"494","stationwagen","5","WIT","Niet geregistreerd","3","1499","1635","2180","1735",,,"20171206","20211012","Geen verstrekking in Open Data","46154","Nee","202",,,,,,"4","4","0","0",,"434","180","M1",,,,"2180","F2AT",,"e1*2007/46*1675*03","2C71","6A1500C0","0","0.02","267","Ja","Nee",,"Nee","0","0","0.00","2023","Onlogisch","04","Nee","2025-05-05T00:00:00.000",,"2017-12-06T00:00:00.000","2021-10-12T00:00:00.000",,,,,,,,,,,"156",,,,,,,,,,,,,,,,,"https://opendata.rdw.nl/resource/3huj-srit.json","https://opendata.rdw.nl/resource/8ys7-d773.json","https://opendata.rdw.nl/resource/vezc-m2t6.json","https://opendata.rdw.nl/resource/jhie-znh9.json","https://opendata.rdw.nl/resource/kmfi-hrps.json"
"N712XZ","Personenauto","BMW","225XE IPERFORMANCE","20240110",,"468","stationwagen","5","ZWART","Niet geregistreerd","3","1499","1635","2180","1735",,,"20170120","20220115","Geen verstrekking in Open Data","53301","Ja","202",,,,,,"4","4","0","0",,"434","180","M1",,,"r. motorruimte","2180","F2AT",,"e1*2007/46*1675*00","2C71","6A2500C0","0","0.02","267","Ja","Nee",,"Nee","0","0","0.00","2022","Geen oordeel","05","Nee","2024-01-10T00:00:00.000",,"2017-01-20T00:00:00.000","2022-01-15T00:00:00.000",,,,,,,,,,,"156",,,,,,,,,,,"20220103","2022-01-03T00:00:00.000",,,,,"https://opendata.rdw.nl/resource/3huj-srit.json","https://opendata.rdw.nl/resource/8ys7-d773.json","https://opendata.rdw.nl/resource/vezc-m2t6.json","https://opendata.rdw.nl/resource/jhie-znh9.json","https://opendata.rdw.nl/resource/kmfi-hrps.json"
"N943FF","Personenauto","BMW","225XE IPERFORMANCE","20240713",,"4331","stationwagen","5","GRIJS","Niet geregistreerd","3","1499","1635","2180","1735",,,"20180713","20220128","Geen verstrekking in Open Data","51581","Nee","202",,,,,,"4","4","0","0",,"435","180","M1",,,,"2180","F2AT",,"e1*2007/46*1675*05","6Y31","DAW50000","0","0.02","267","Ja","Nee",,"Nee","0","0","0.00","2022","Geen oordeel","05","Nee","2024-07-13T00:00:00.000",,"2018-07-13T00:00:00.000","2022-01-28T00:00:00.000",,,,,,,,,,,"156",,,,,,,,,,,,,,,,,"https://opendata.rdw.nl/resource/3huj-srit.json","https://opendata.rdw.nl/resource/8ys7-d773.json","https://opendata.rdw.nl/resource/vezc-m2t6.json","https://opendata.rdw.nl/resource/jhie-znh9.json","https://opendata.rdw.nl/resource/kmfi-hrps.json"
"N994BJ","Personenauto","BMW","225XE IPERFORMANCE","20250831","20210903","3563","stationwagen","5","BLAUW","Niet geregistreerd","3","1499","1635","2180","1735",,,"20190607","20210903","Geen verstrekking in Open Data","50193","Nee","202",,,,,,"4","4","0","0",,"435","180","M1",,,"r. motorruimte","2180","F2AT",,"e1*2007/46*1675*07","6Y31","DAW50000","0","0.02","267","Ja","Nee",,"Nee","0","0","0.00","2024","Geen oordeel","05","Nee","2025-08-31T00:00:00.000","2021-09-03T00:00:00.000","2019-06-07T00:00:00.000","2021-09-03T00:00:00.000",,,,,,,,,,,"156",,,,,,,,,,,,,,,,,"https://opendata.rdw.nl/resource/3huj-srit.json","https://opendata.rdw.nl/resource/8ys7-d773.json","https://opendata.rdw.nl/resource/vezc-m2t6.json","https://opendata.rdw.nl/resource/jhie-znh9.json","https://opendata.rdw.nl/resource/kmfi-hrps.json"
"ND723S","Personenauto","BMW","225XE IPERFORMANCE",,,"469","stationwagen","5","ZWART","Niet geregistreerd","3","1499","1635","2180","1735",,,"20161230","20161230","Geen verstrekking in Open Data","50128","Nee",,,,,,,"4","4","0","0",,"434","0","M1",,,"in motorruimte r.","2180","F2AT",,"e1*2007/46*1675*00","2C71","6A2500C0","0","0.06","267","Ja","Nee",,"Nee","0","0","0.00","2022","Logisch","00","Nee",,,"2016-12-30T00:00:00.000","2016-12-30T00:00:00.000",,,,,,,,,,,,,,,,,,,,,"A",,,,,,,"https://opendata.rdw.nl/resource/3huj-srit.json","https://opendata.rdw.nl/resource/8ys7-d773.json","https://opendata.rdw.nl/resource/vezc-m2t6.json","https://opendata.rdw.nl/resource/jhie-znh9.json","https://opendata.rdw.nl/resource/kmfi-hrps.json"
"ND730B","Personenauto","BMW","225XE IPERFORMANCE","20250113",,"469","stationwagen","5","ZWART","Niet geregistreerd","3","1499","1635","2180","1735",,,"20161230","20161230","Geen verstrekking in Open Data","53099","Nee",,,,,,,"4","4","0","0",,"434","180","M1",,,"in motorruimte r.","2180","F2AT",,"e1*2007/46*1675*00","2C71","6A2500C0","0","0.06","267","Ja","Nee",,"Nee","0","0","0.00","2023","Logisch","00","Nee","2025-01-13T00:00:00.000",,"2016-12-30T00:00:00.000","2016-12-30T00:00:00.000",,,,,,,,,,,"156",,,,,,,,,,"A",,,,,,,"https://opendata.rdw.nl/resource/3huj-srit.json","https://opendata.rdw.nl/resource/8ys7-d773.json","https://opendata.rdw.nl/resource/vezc-m2t6.json","https://opendata.rdw.nl/resource/jhie-znh9.json","https://opendata.rdw.nl/resource/kmfi-hrps.json"
"ND893B","Personenauto","BMW","225XE IPERFORMANCE",,,"469","stationwagen","5","GRIJS","Niet geregistreerd","3","1499","1635","2180","1735",,,"20161229","20161229","Geen verstrekking in Open Data","50751","Nee",,,,,,,"4","4","0","0",,"434","0","M1",,,"in motorruimte r.","2180","F2AT",,"e1*2007/46*1675*00","2C71","6A2500C0","0","0.06","267","Ja","Nee",,"Nee","0","0","0.00","2022","Logisch","00","Nee",,,"2016-12-29T00:00:00.000","2016-12-29T00:00:00.000",,,,,,,,,,,,,,,,,,,,,"A",,,,,,,"https://opendata.rdw.nl/resource/3huj-srit.json","https://opendata.rdw.nl/resource/8ys7-d773.json","https://opendata.rdw.nl/resource/vezc-m2t6.json","https://opendata.rdw.nl/resource/jhie-znh9.json","https://opendata.rdw.nl/resource/kmfi-hrps.json"
"P477NF","Personenauto","BMW","225XE IPERFORMANCE",,,"1310","stationwagen","5","ROOD","Niet geregistreerd","3","1499","1635","2180","1735",,,"20190402","20220530","Geen verstrekking in Open Data","47674","Nee","202",,,,,,"4","4","0","0",,"435","180","M1",,,,"2180","F2AT",,"e1*2007/46*1675*07","6Y31","DAW50000","0","0.02","267","Ja","Nee",,"Nee","0","0","0.00","2022","Geen oordeel","05","Nee",,,"2019-04-02T00:00:00.000","2022-05-30T00:00:00.000",,,,,,,,,,,"156",,,,,,,,,,,"20220411","2022-04-11T00:00:00.000",,,,,"https://opendata.rdw.nl/resource/3huj-srit.json","https://opendata.rdw.nl/resource/8ys7-d773.json","https://opendata.rdw.nl/resource/vezc-m2t6.json","https://opendata.rdw.nl/resource/jhie-znh9.json","https://opendata.rdw.nl/resource/kmfi-hrps.json"
"TF557T","Personenauto","BMW","225XE IPERFORMANCE","20240723",,"4333","stationwagen","5","BLAUW","Niet geregistreerd","3","1499","1635","2180","1735",,,"20180723","20180723","Geen verstrekking in Open Data","53062","Nee",,,,,,,"4","4","0","0",,"435","180","M1",,,,"2180","F2AT",,"e1*2007/46*1675*05","6Y31","DAW50000","0","0.06","267","Ja","Nee",,"Nee","0","0","0.00","2023","Logisch","00","Nee","2024-07-23T00:00:00.000",,"2018-07-23T00:00:00.000","2018-07-23T00:00:00.000",,,,,,,,,,,"156",,,,,,,,,,,,,,,,,"https://opendata.rdw.nl/resource/3huj-srit.json","https://opendata.rdw.nl/resource/8ys7-d773.json","https://opendata.rdw.nl/resource/vezc-m2t6.json","https://opendata.rdw.nl/resource/jhie-znh9.json","https://opendata.rdw.nl/resource/kmfi-hrps.json"
"TP706K","Personenauto","BMW","225XE IPERFORMANCE","20240924",,"2888","stationwagen","5","ZWART","Niet geregistreerd","3","1499","1635","2180","1735",,,"20180924","20180924","Geen verstrekking in Open Data","44165","Ja",,,,,,,"4","4","0","0",,"435","180","M1",,,,"2180","F2AT",,"e1*2007/46*1675*05","6Y31","DAW50000","0","0.06","267","Ja","Nee",,"Nee","0","0","0.00","2023","Logisch","00","Nee","2024-09-24T00:00:00.000",,"2018-09-24T00:00:00.000","2018-09-24T00:00:00.000",,,,,,,,,,,"156",,,,,,,,,,,,,,,,,"https://opendata.rdw.nl/resource/3huj-srit.json","https://opendata.rdw.nl/resource/8ys7-d773.json","https://opendata.rdw.nl/resource/vezc-m2t6.json","https://opendata.rdw.nl/resource/jhie-znh9.json","https://opendata.rdw.nl/resource/kmfi-hrps.json"
"XR451N","Personenauto","BMW","225XE IPERFORMANCE","20250306","20240402","3612","stationwagen","5","ZWART","Niet geregistreerd","3","1499","1635","2180","1735",,,"20190306","20190306","Geen verstrekking in Open Data","46582","Ja",,,,,,,"4","4","0","0",,"435","180","M1",,,,"2180","F2AT",,"e1*2007/46*1675*06","6Y31","DAW50000","0","0.06","267","Ja","Nee",,"Nee","0","0","0.00","2024","Logisch","00","Nee","2025-03-06T00:00:00.000","2024-04-02T00:00:00.000","2019-03-06T00:00:00.000","2019-03-06T00:00:00.000",,,,,,,,,,,"156",,,,,,,,,,,,,,,,,"https://opendata.rdw.nl/resource/3huj-srit.json","https://opendata.rdw.nl/resource/8ys7-d773.json","https://opendata.rdw.nl/resource/vezc-m2t6.json","https://opendata.rdw.nl/resource/jhie-znh9.json","https://opendata.rdw.nl/resource/kmfi-hrps.json"
"ZN961F","Personenauto","BMW","225XE IPERFORMANCE",,,"3612","stationwagen","5","WIT","Niet geregistreerd","3","1499","1635","2180","1735",,,"20190716","20190716","Geen verstrekking in Open Data","44904","Nee",,,,,,,"4","4","0","0",,"435","180","M1",,,,"2180","F2AT",,"e1*2007/46*1675*07","6Y31","DAW50000","0","0.06","267","Ja","Nee",,"Nee","0","0","0.00","2023","Logisch","00","Nee",,,"2019-07-16T00:00:00.000","2019-07-16T00:00:00.000",,,,,,,,,,,"156",,,,,,,,,,,,,,,,,"https://opendata.rdw.nl/resource/3huj-srit.json","https://opendata.rdw.nl/resource/8ys7-d773.json","https://opendata.rdw.nl/resource/vezc-m2t6.json","https://opendata.rdw.nl/resource/jhie-znh9.json","https://opendata.rdw.nl/resource/kmfi-hrps.json"
"ZS733D","Personenauto","BMW","225XE IPERFORMANCE","20240720",,"2483","stationwagen","5","WIT","Niet geregistreerd","3","1499","1635","2180","1735",,,"20180720","20190718","Geen verstrekking in Open Data","63149","Nee","202",,,,,,"4","4","0","0",,"435","180","M1",,,"r. motorruimte","2180","F2AT",,"e1*2007/46*1675*05","6Y31","DAW50000","0","0.02","267","Ja","Nee",,"Nee","0","0","0.00","2024","Geen oordeel","05","Nee","2024-07-20T00:00:00.000",,"2018-07-20T00:00:00.000","2019-07-18T00:00:00.000",,,,,,,,,,,"16",,,,,,,,,,,,,,,,,"https://opendata.rdw.nl/resource/3huj-srit.json","https://opendata.rdw.nl/resource/8ys7-d773.json","https://opendata.rdw.nl/resource/vezc-m2t6.json","https://opendata.rdw.nl/resource/jhie-znh9.json","https://opendata.rdw.nl/resource/kmfi-hrps.json"
