"kenteken","voertuigsoort","merk","handelsbenaming","vervaldatum_apk","datum_tenaamstelling","bruto_bpm","inrichting","aantal_zitplaatsen","eerste_kleur","tweede_kleur","aantal_cilinders","cilinderinhoud","massa_ledig_voertuig","toegestane_maximum_massa_voertuig","massa_rijklaar","maximum_massa_trekken_ongeremd","maximum_trekken_massa_geremd","datum_eerste_toelating","datum_eerste_tenaamstelling_in_nederland","wacht_op_keuren","catalogusprijs","wam_verzekerd","maximale_constructiesnelheid","laadvermogen","oplegger_geremd","aanhangwagen_autonoom_geremd","aanhangwagen_middenas_geremd","aantal_staanplaatsen","aantal_deuren","aantal_wielen","afstand_hart_koppeling_tot_achterzijde_voertuig","afstand_voorzijde_voertuig_tot_hart_koppeling","afwijkende_maximum_snelheid","lengte","breedte","europese_voertuigcategorie","europese_voertuigcategorie_toevoeging","europese_uitvoeringcategorie_toevoeging","plaats_chassisnummer","technische_max_massa_voertuig","type","type_gasinstallatie","typegoedkeuringsnummer","variant","uitvoering","volgnummer_wijziging_eu_typegoedkeuring","vermogen_massarijklaar","wielbasis","export_indicator","openstaande_terugroepactie_indicator","vervaldatum_tachograaf","taxi_indicator","maximum_massa_samenstelling","aantal_rolstoelplaatsen","maximum_ondersteunende_snelheid","jaar_laatste_registratie_tellerstand","tellerstandoordeel","code_toelichting_tellerstandoordeel","tenaamstellen_mogelijk","vervaldatum_apk_dt","datum_tenaamstelling_dt","datum_eerste_toelating_dt","datum_eerste_tenaamstelling_in_nederland_dt","vervaldatum_tachograaf_dt","maximum_last_onder_de_vooras_sen_tezamen_koppeling","type_remsysteem_voertuig_code","rupsonderstelconfiguratiecode","wielbasis_voertuig_minimum","wielbasis_voertuig_maximum","lengte_voertuig_minimum","lengte_voertuig_maximum","breedte_voertuig_minimum","breedte_voertuig_maximum","hoogte_voertuig","hoogte_voertuig_minimum","hoogte_voertuig_maximum","massa_bedrijfsklaar_minimaal","massa_bedrijfsklaar_maximaal","technisch_toelaatbaar_massa_koppelpunt","maximum_massa_technisch_maximaal","maximum_massa_technisch_minimaal","subcategorie_nederland","verticale_belasting_koppelpunt_getrokken_voertuig","zuinigheidsclassificatie","registratie_datum_goedkeuring_afschrijvingsmoment_bpm","registratie_datum_goedkeuring_afschrijvingsmoment_bpm_dt","gem_lading_wrde","aerodyn_voorz","massa_alt_aandr","verl_cab_ind","api_gekentekende_voertuigen_assen","api_gekentekende_voertuigen_brandstof","api_gekentekende_voertuigen_carrosserie","api_gekentekende_voertuigen_carrosserie_specifiek","api_gekentekende_voertuigen_voertuigklasse"
"G758GL","Personenauto","AUDI","SQ7","20240717","20240109","28219","stationwagen","5","ZWART","Niet geregistreerd","8","3956","2245","3030","2345","750","3500","20170717","20191022","Geen verstrekking in Open Data","166972","Ja","250",,,,,,"4","4","0","0",,"0","0","M1",,,,"3030","4L",,"e1*2001/116*0350*27","XCZACQ2","QA8QA8D6007P4L107MVEM1S5FLK1","0","0.14","300","Ja","Nee",,"Nee","6530","0","0.00","2024","Geen oordeel","05","Nee","2024-07-17T00:00:00.000","2024-01-09T00:00:00.000","2017-07-17T00:00:00.000","2019-10-22T00:00:00.000",,,,,,,,,,,,,,,,,,,,,"E",,,,,,,"https://opendata.rdw.nl/resource/3huj-srit.json","https://opendata.rdw.nl/resource/8ys7-d773.json","https://opendata.rdw.nl/resource/vezc-m2t6.json","https://opendata.rdw.nl/resource/jhie-znh9.json","https://opendata.rdw.nl/resource/kmfi-hrps.json"
"G856BP","Personenauto","AUDI","SQ7","20230424",,"32546","stationwagen","7","GRIJS","Niet geregistreerd","8","3956","2305","3200","2405","750","3500","20180424","20190831","Geen verstrekking in Open Data","220286","Nee","250",,,,,,"4","4","0","0",,"0","0","M1",,,,"3200","4L",,"e1*2001/116*0350*31","XCZACQ2","QA8QA8D6007P4L067MVEM1S7FL","0","0.13","300","Ja","Nee",,"Nee","6700","0","0.00","2022","Geen oordeel","05","Nee","2023-04-24T00:00:00.000",,"2018-04-24T00:00:00.000","2019-08-31T00:00:00.000",,,,,,,,,,,,,,,,,,,,,"G",,,,,,,"https://opendata.rdw.nl/resource/3huj-srit.json","https://opendata.rdw.nl/resource/8ys7-d773.json","https://opendata.rdw.nl/resource/vezc-m2t6.json","https://opendata.rdw.nl/resource/jhie-znh9.json","https://opendata.rdw.nl/resource/kmfi-hrps.json"
"H011ZS","Personenauto","AUDI","SQ7","20240703",,"23626","stationwagen","5","GRIJS","Niet geregistreerd","8","3956","2245","3030","2345","750","3500","20161115","20200624","Geen verstrekking in Open Data","157434","Nee","250",,,,,,"4","4","0","0",,"0","0","M1",,,,"3030","4L",,"e1*2001/116*0350*26","XCZACQ2","QA8QA8D6007P4L067MVEM1S5FLK1","0","0.14","300","Ja","Nee",,"Nee","6530","0","0.00","2023","Geen oordeel","05","Nee","2024-07-03T00:00:00.000",,"2016-11-15T00:00:00.000","2020-06-24T00:00:00.000",,,,,,,,,,,,,,,,,,,,,"E",,,,,,,"https://opendata.rdw.nl/resource/3huj-srit.json","https://opendata.rdw.nl/resource/8ys7-d773.json","https://opendata.rdw.nl/resource/vezc-m2t6.json","https://opendata.rdw.nl/resource/jhie-znh9.json","https://opendata.rdw.nl/resource/kmfi-hrps.json"
"H500JZ","Personenauto","AUDI","SQ7","20230926",,"33356","stationwagen","7","ZWART","Niet geregistreerd","8","3956","2360","3155","2460","750","3500","20190920","20200220","Geen verstrekking in Open Data","174137","Nee","250",,,,,,"4","4","0","0",,"506","197","M1",,,"r. motorruimte","3155","4L",,"e1*2001/116*0350*38","XDMVAQ2","QA8QA8D6007RT101C224BFBEM1S7FL","0","0.13","300","Ja","Nee",,"Nee","6655","0","0.00","2023","Geen oordeel","05","Nee","2023-09-26T00:00:00.000",,"2019-09-20T00:00:00.000","2020-02-20T00:00:00.000",,,,,,,,,,,"167",,,,,,,,,,,,,,,,,"https://opendata.rdw.nl/resource/3huj-srit.json","https://opendata.rdw.nl/resource/8ys7-d773.json","https://opendata.rdw.nl/resource/vezc-m2t6.json","https://opendata.rdw.nl/resource/jhie-znh9.json","https://opendata.rdw.nl/resource/kmfi-hrps.json"
"J307SP","Personenauto","AUDI","SQ7","20240628",,"24588","stationwagen","5","ZWART","Niet geregistreerd","8","3956","2295","3050","2395","750","3500","20190918","20201009","Geen verstrekking in Open Data","191573","Nee","250",,,,,,"4","4","0","0",,"0","197","M1",,,,"3050","4L",,"e1*2001/116*0350*38","XDMVAQ2","QA8QA8D6007RT101C224BFBEM1S5FL","0","0.13","300","Ja","Nee",,"Nee","6550","0","0.00","2023","Geen oordeel","05","Nee","2024-06-28T00:00:00.000",,"2019-09-18T00:00:00.000","2020-10-09T00:00:00.000",,,,,,,,,,,,,,,,,,,,,,,,,,,,"https://opendata.rdw.nl/resource/3huj-srit.json","https://opendata.rdw.nl/resource/8ys7-d773.json","https://opendata.rdw.nl/resource/vezc-m2t6.json","https://opendata.rdw.nl/resource/jhie-znh9.json","https://opendata.rdw.nl/resource/kmfi-hrps.json"
"J747KG","Personenauto","AUDI","SQ7","20241108",,"27652","stationwagen","5","GRIJS","Niet geregistreerd","8","3956","2245","3030","2345","750","3500","20180823","20200827","Geen verstrekking in Open Data","188897","Nee","250",,,,,,"4","4","0","0",,"0","0","M1",,,,"3030","4L",,"e1*2001/116*0350*31","XCZACQ2","QA8QA8D6007P4L067MVEM1S5FL","0","0.14","300","Ja","Nee",,"Nee","6530","0","0.00","2023","Geen oordeel","05","Nee","2024-11-08T00:00:00.000",,"2018-08-23T00:00:00.000","2020-08-27T00:00:00.000",,,,,,,,,,,,,,,,,,,,,"G",,,,,,,"https://opendata.rdw.nl/resource/3huj-srit.json","https://opendata.rdw.nl/resource/8ys7-d773.json","https://opendata.rdw.nl/resource/vezc-m2t6.json","https://opendata.rdw.nl/resource/jhie-znh9.json","https://opendata.rdw.nl/resource/kmfi-hrps.json"
"J748RH","Personenauto","AUDI","SQ7",,,"35055","stationwagen","7","ZWART","Niet geregistreerd","8","3956","2305","3200","2405","750","3500","20170628","20200928","Geen verstrekking in Open Data","149549","Nee",,,,,,,"4","4","0","0",,"0","0","M1",,,"r. motorruimte by voorwielscherm","3200","4L",,"e1*2001/116*0350*28","XCZACQ2","QA8QA8D6007P4L107MVEM1S7FL","0","0.13","300","Ja","Nee",,"Nee","6700","0","0.00","2021","Geen oordeel","05","Nee",,,"2017-06-28T00:00:00.000","2020-09-28T00:00:00.000",,,,,,,,,,,,,,,,,,,,,"E",,,,,,,"https://opendata.rdw.nl/resource/3huj-srit.json","https://opendata.rdw.nl/resource/8ys7-d773.json","https://opendata.rdw.nl/resource/vezc-m2t6.json","https://opendata.rdw.nl/resource/jhie-znh9.json","https://opendata.rdw.nl/resource/kmfi-hrps.json"
"J877PG","Personenauto","AUDI","SQ7","20231020",,"32471","stationwagen","5","ZWART","Niet geregistreerd","8","3956","2245","3030","2345","750","3500","20171020","20200921","Geen verstrekking in Open Data","145315","Nee","250",,,,,,"4","4",,,,,,"M1",,,,"3030","4L",,"e1*2001/116*0350*29","XCZACQ1","QA8QA8D6007P4L067MVEM1S5FL","0","0.14","300","Ja","Nee",,"Nee","6530",,,"2023","Geen oordeel","05","Nee","2023-10-20T00:00:00.000",,"2017-10-20T00:00:00.000","2020-09-21T00:00:00.000",,,,,,,,,,,,,,,,,,,,,"E",,,,,,,"https://opendata.rdw.nl/resource/3huj-srit.json","https://opendata.rdw.nl/resource/8ys7-d773.json","https://opendata.rdw.nl/resource/vezc-m2t6.json","https://opendata.rdw.nl/resource/jhie-znh9.json","https://opendata.rdw.nl/resource/kmfi-hrps.json"
"J896GT","Personenauto","AUDI","SQ7","20230914",,"23313","stationwagen","5","ZWART","Niet geregistreerd","8","3956","2245","3030","2345","750","3500","20170418","20200915","Geen verstrekking in Open Data","151049","Nee","250",,,,,,"4","4","0","0",,"0","0","M1",,,,"3030","4L",,"e1*2001/116*0350*27","XCZACQ2","QA8QA8D6007P4L077MVEM1S5FLK1","0","0.14","300","Ja","Nee",,"Nee","6530","0","0.00","2023","Geen oordeel","05","Nee","2023-09-14T00:00:00.000",,"2017-04-18T00:00:00.000","2020-09-15T00:00:00.000",,,,,,,,,,,,,,,,,,,,,"D",,,,,,,"https://opendata.rdw.nl/resource/3huj-srit.json","https://opendata.rdw.nl/resource/8ys7-d773.json","https://opendata.rdw.nl/resource/vezc-m2t6.json","https://opendata.rdw.nl/resource/jhie-znh9.json","https://opendata.rdw.nl/resource/kmfi-hrps.json"
"K046LZ","Personenauto","AUDI","SQ7","20240430","20240103","30055","stationwagen","7","BLAUW","Niet geregistreerd","8","3956","2305","3200","2405","750","3500","20170531","20210109","Geen verstrekking in Open Data","163505","Ja","250",,,,,,"4","4","0","0",,"505","197","M1",,,"r. motorruimte by voorwielscherm","3200","4L",,"e1*2001/116*0350*27","XCZACQ2","QA8QA8D6007P4L067MVEM1S7FLK1","0","0.13","300","Ja","Nee",,"Nee","6700","0","0.00","2024","Geen oordeel","05","Nee","2024-04-30T00:00:00.000","2024-01-03T00:00:00.000","2017-05-31T00:00:00.000","2021-01-09T00:00:00.000",,,,,,,,,,,"167",,,,,,,,,,"E",,,,,,,"https://opendata.rdw.nl/resource/3huj-srit.json","https://opendata.rdw.nl/resource/8ys7-d773.json","https://opendata.rdw.nl/resource/vezc-m2t6.json","https://opendata.rdw.nl/resource/jhie-znh9.json","https://opendata.rdw.nl/resource/kmfi-hrps.json"
"K081VB","Personenauto","AUDI","SQ7","20230930",,"19312","stationwagen","7","ZWART","Niet geregistreerd","8","3956","2305","3200","2405","750","3500","20160902","20210308","Geen verstrekking in Open Data","172618","Nee","250",,,,,,"4","4","0","0",,"0","0","M1",,,"r. motorruimte by voorwielscherm","3200","4L",,"e1*2001/116*0350*26","XCZACQ2","QA8QA8D6007P4L067MVEM1S7FLK1","0","0.13","300","Ja","Nee",,"Nee","6700","0","0.00","2023","Geen oordeel","05","Nee","2023-09-30T00:00:00.000",,"2016-09-02T00:00:00.000","2021-03-08T00:00:00.000",,,,,,,,,,,,,,,,,,,,,"E",,,,,,,"https://opendata.rdw.nl/resource/3huj-srit.json","https://opendata.rdw.nl/resource/8ys7-d773.json","https://opendata.rdw.nl/resource/vezc-m2t6.json","https://opendata.rdw.nl/resource/jhie-znh9.json","https://opendata.rdw.nl/resource/kmfi-hrps.json"
"K115NP","Personenauto","AUDI","SQ7","20240221",,"19106","stationwagen","7","GRIJS","Niet geregistreerd","8","3956","2305","3200","2405","750","3500","20170102","20210113","Geen verstrekking in Open Data","152645","Nee","250",,,,,,"4","4","0","0",,"0","0","M1",,,,"3200","4L",,"e1*2001/116*0350*27","XCZACQ2","QA8QA8D6007P4L067MVEM1S7FLK1","0","0.13","300","Ja","Nee",,"Nee","6700","0","0.00","2023","Geen oordeel","05","Nee","2024-02-21T00:00:00.000",,"2017-01-02T00:00:00.000","2021-01-13T00:00:00.000",,,,,,,,,,,,,,,,,,,,,"E",,,,,,,"https://opendata.rdw.nl/resource/3huj-srit.json","https://opendata.rdw.nl/resource/8ys7-d773.json","https://opendata.rdw.nl/resource/vezc-m2t6.json","https://opendata.rdw.nl/resource/jhie-znh9.json","https://opendata.rdw.nl/resource/kmfi-hrps.json"
"K846PF","Personenauto","AUDI","SQ7","20240129",,"21472","stationwagen","7","ZWART","Niet geregistreerd","8","3956","2305","3200","2405","750","3500","20170825","20210121","Geen verstrekking in Open Data","163589","Nee","250",,,,,,"4","4","0","0",,"0","0","M1",,,,"3200","4L",,"e1*2001/116*0350*29","XCZACQ1","QA8QA8D6007P4L107MVEM1S7FL","0","0.13","300","Ja","Nee",,"Nee","6700","0","0.00","2024","Onlogisch","04","Nee","2024-01-29T00:00:00.000",,"2017-08-25T00:00:00.000","2021-01-21T00:00:00.000",,,,,,,,,,,,,,,,,,,,,"E",,,,,,,"https://opendata.rdw.nl/resource/3huj-srit.json","https://opendata.rdw.nl/resource/8ys7-d773.json","https://opendata.rdw.nl/resource/vezc-m2t6.json","https://opendata.rdw.nl/resource/jhie-znh9.json","https://opendata.rdw.nl/resource/kmfi-hrps.json"
"K860TV","Personenauto","AUDI","SQ7","20240310",,"15958","stationwagen","5","ZWART","Niet geregistreerd","8","3956","2245","3030","2345","750","3500","20170221","20210305","Geen verstrekking in Open Data","146903","Nee","250",,,,,,"4","4","0","0",,"0","0","M1",,,,"3030","4L",,"e1*2001/116*0350*27","XCZACQ2","QA8QA8D6007P4L067MVEM1S5FLK1","0","0.14","300","Ja","Nee",,"Nee","6530","0","0.00","2023","Geen oordeel","05","Nee","2024-03-10T00:00:00.000",,"2017-02-21T00:00:00.000","2021-03-05T00:00:00.000",,,,,,,,,,,,,,,,,,,,,"E",,,,,,,"https://opendata.rdw.nl/resource/3huj-srit.json","https://opendata.rdw.nl/resource/8ys7-d773.json","https://opendata.rdw.nl/resource/vezc-m2t6.json","https://opendata.rdw.nl/resource/jhie-znh9.json","https://opendata.rdw.nl/resource/kmfi-hrps.json"
"K924ZL","Personenauto","AUDI","SQ7","20240402",,"7976","stationwagen","5","GRIJS","Niet geregistreerd","8","3956","2245","3030","2345","750","3500","20161014","20210331","Geen verstrekking in Open Data","128034","Nee","250",,,,,,"4","4","0","0",,"0","0","M1",,,,"3030","4L",,"e1*2001/116*0350*26","XCZACQ2","QA8QA8D6007P4L067MVEM1S5FLK1","0","0.14","300","Ja","Nee",,"Nee","6530","0","0.00","2023","Geen oordeel","05","Nee","2024-04-02T00:00:00.000",,"2016-10-14T00:00:00.000","2021-03-31T00:00:00.000",,,,,,,,,,,,,,,,,,,,,"E",,,,,,,"https://opendata.rdw.nl/resource/3huj-srit.json","https://opendata.rdw.nl/resource/8ys7-d773.json","https://opendata.rdw.nl/resource/vezc-m2t6.json","https://opendata.rdw.nl/resource/jhie-znh9.json","https://opendata.rdw.nl/resource/kmfi-hrps.json"
"KF669N","Personenauto","AUDI","SQ7","20240903","20240322","36487","stationwagen","7","WIT","Niet geregistreerd","8","3956","2305","3200","2405","750","3500","20160825","20160825","Geen verstrekking in Open Data","174402","Nee",,,,,,,"4","4","0","0",,"505","197","M1",,,"in motorruimte r.","3200","4L",,"e1*2001/116*0350*26","XCZACQ2","QA8QA8D6007P4L067MVEM1S7FLK1","0","0.13","300","Ja","Ja",,"Nee","6700","0","0.00","2024","Logisch","00","Nee","2024-09-03T00:00:00.000","2024-03-22T00:00:00.000","2016-08-25T00:00:00.000","2016-08-25T00:00:00.000",,,,,,,,,,,"167",,,,,,,,,,"E",,,,,,,"https://opendata.rdw.nl/resource/3huj-srit.json","https://opendata.rdw.nl/resource/8ys7-d773.json","https://opendata.rdw.nl/resource/vezc-m2t6.json","https://opendata.rdw.nl/resource/jhie-znh9.json","https://opendata.rdw.nl/resource/kmfi-hrps.json"
"KG064V","Personenauto","AUDI","SQ7","20250109","20240402","39806","stationwagen","7","GRIJS","Niet geregistreerd","8","3956","2305","3200","2405","750","3500","20170328","20170328","Geen verstrekking in Open Data","163216","Ja",,,,,,,"4","4","0","0",,"505","197","M1",,,"in motorruimte r.","3200","4L",,"e1*2001/116*0350*26","XCZACQ2","QA8QA8D6007P4L067MVEM1S7FLK1","0","0.13","300","Ja","Nee",,"Nee","6700","0","0.00","2024","Logisch","00","Nee","2025-01-09T00:00:00.000","2024-04-02T00:00:00.000","2017-03-28T00:00:00.000","2017-03-28T00:00:00.000",,,,,,,,,,,"167",,,,,,,,,,"E",,,,,,,"https://opendata.rdw.nl/resource/3huj-srit.json","https://opendata.rdw.nl/resource/8ys7-d773.json","https://opendata.rdw.nl/resource/vezc-m2t6.json","https://opendata.rdw.nl/resource/jhie-znh9.json","https://opendata.rdw.nl/resource/kmfi-hrps.json"
"KG143V","Personenauto","AUDI","SQ7","20240519","20240220","36487","stationwagen","7","ZWART","Niet geregistreerd","8","3956","2305","3200","2405","750","3500","20161003","20161003","Geen verstrekking in Open Data","159897","Nee",,,,,,,"4","4","0","0",,"505","197","M1",,,"in motorruimte r.","3200","4L",,"e1*2001/116*0350*26","XCZACQ2","QA8QA8D6007P4L067MVEM1S7FLK1","0","0.13","300","Ja","Nee",,"Nee","6700","0","0.00","2024","Logisch","00","Nee","2024-05-19T00:00:00.000","2024-02-20T00:00:00.000","2016-10-03T00:00:00.000","2016-10-03T00:00:00.000",,,,,,,,,,,"167",,,,,,,,,,"E",,,,,,,"https://opendata.rdw.nl/resource/3huj-srit.json","https://opendata.rdw.nl/resource/8ys7-d773.json","https://opendata.rdw.nl/resource/vezc-m2t6.json","https://opendata.rdw.nl/resource/jhie-znh9.json","https://opendata.rdw.nl/resource/kmfi-hrps.json"
"KG195V","Personenauto","AUDI","SQ7","20231130",,"36487","stationwagen","7","ZWART","Niet geregistreerd","8","3956","2305","3200","2405","750","3500","20160907","20160907","Geen verstrekking in Open Data","159897","Nee",,,,,,,"4","4","0","0",,"505","197","M1",,,"in motorruimte r.","3200","4L",,"e1*2001/116*0350*26","XCZACQ2","QA8QA8D6007P4L067MVEM1S7FLK1","0","0.13","300","Ja","Nee",,"Nee","6700","0","0.00","2023","Logisch","00","Nee","2023-11-30T00:00:00.000",,"2016-09-07T00:00:00.000","2016-09-07T00:00:00.000",,,,,,,,,,,"167",,,,,,,,,,"E",,,,,,,"https://opendata.rdw.nl/resource/3huj-srit.json","https://opendata.rdw.nl/resource/8ys7-d773.json","https://opendata.rdw.nl/resource/vezc-m2t6.json","https://opendata.rdw.nl/resource/jhie-znh9.json","https://opendata.rdw.nl/resource/kmfi-hrps.json"
"KG352V","Personenauto","AUDI","SQ7","20231116","20221001","39806","stationwagen","7","ZWART","Niet geregistreerd","8","3956","2305","3200","2405","750","3500","20171116","20171116","Geen verstrekking in Open Data","163216","Nee",,,,,,,"4","4","0","0",,"505","197","M1",,,"in motorruimte r.","3200","4L",,"e1*2001/116*0350*26","XCZACQ2","QA8QA8D6007P4L067MVEM1S7FLK1","0","0.13","300","Ja","Nee",,"Nee","6700","0","0.00","2022","Logisch","00","Nee","2023-11-16T00:00:00.000","2022-10-01T00:00:00.000","2017-11-16T00:00:00.000","2017-11-16T00:00:00.000",,,,,,,,,,,"167",,,,,,,,,,"E",,,,,,,"https://opendata.rdw.nl/resource/3huj-srit.json","https://opendata.rdw.nl/resource/8ys7-d773.json","https://opendata.rdw.nl/resource/vezc-m2t6.json","https://opendata.rdw.nl/resource/jhie-znh9.json","https://opendata.rdw.nl/resource/kmfi-hrps.json"
"KH977V","Personenauto","AUDI","SQ7","20240113",,"24600","stationwagen","7","GRIJS","Niet geregistreerd","8","3956","2305","3200","2405","750","3500","20160914","20160914","Geen verstrekking in Open Data","177423","Ja",,,,,,,"4","4","0","0",,"505","197","M1",,,"in motorruimte r.","3200","4L",,"e1*2001/116*0350*26","XCZACQ2","QA8QA8D6007P4L067MVEM1S7FLK1","0","0.13","300","Ja","Nee",,"Nee","6700","0","0.00","2023","Geen oordeel","05","Nee","2024-01-13T00:00:00.000",,"2016-09-14T00:00:00.000","2016-09-14T00:00:00.000",,,,,,,,,,,"167",,,,,,,,,,"E",,,,,,,"https://opendata.rdw.nl/resource/3huj-srit.json","https://opendata.rdw.nl/resource/8ys7-d773.json","https://opendata.rdw.nl/resource/vezc-m2t6.json","https://opendata.rdw.nl/resource/jhie-znh9.json","https://opendata.rdw.nl/resource/kmfi-hrps.json"
"KJ350N","Personenauto","AUDI","SQ7","20230922",,"31407","stationwagen","7","GRIJS","Niet geregistreerd","8","3956","2305","3200","2405","750","3500","20160922","20160922","Geen verstrekking in Open Data","175413","Nee",,,,,,,"4","4","0","0",,"505","197","M1",,,"in motorruimte r.","3200","4L",,"e1*2001/116*0350*26","XCZACQ2","QA8QA8D6007P4L077MVEM1S7FLK1","0","0.13","300","Ja","Nee",,"Nee","6700","0","0.00","2022","Logisch","00","Nee","2023-09-22T00:00:00.000",,"2016-09-22T00:00:00.000","2016-09-22T00:00:00.000",,,,,,,,,,,"167",,,,,,,,,,"D",,,,,,,"https://opendata.rdw.nl/resource/3huj-srit.json","https://opendata.rdw.nl/resource/8ys7-d773.json","https://opendata.rdw.nl/resource/vezc-m2t6.json","https://opendata.rdw.nl/resource/jhie-znh9.json","https://opendata.rdw.nl/resource/kmfi-hrps.json"
"KK357S","Personenauto","AUDI","SQ7","20240930",,"36487","stationwagen","7","ZWART","Niet geregistreerd","8","3956","2305","3200","2405","750","3500","20160930","20160930","Geen verstrekking in Open Data","177402","Nee",,,,,,,"4","4","0","0",,"505","197","M1",,,"in motorruimte r.","3200","4L",,"e1*2001/116*0350*26","XCZACQ2","QA8QA8D6007P4L107MVEM1S7FLK1","0","0.13","300","Ja","Nee",,"Nee","6700","0","0.00","2023","Logisch","00","Nee","2024-09-30T00:00:00.000",,"2016-09-30T00:00:00.000","2016-09-30T00:00:00.000",,,,,,,,,,,"167",,,,,,,,,,"E",,,,,,,"https://opendata.rdw.nl/resource/3huj-srit.json","https://opendata.rdw.nl/resource/8ys7-d773.json","https://opendata.rdw.nl/resource/vezc-m2t6.json","https://opendata.rdw.nl/resource/jhie-znh9.json","https://opendata.rdw.nl/resource/kmfi-hrps.json"
"KP427B","Personenauto","AUDI","SQ7","20230908",,"27405","stationwagen","7","ZWART","Niet geregistreerd","8","3956","2305","3200","2405","750","3500","20160908","20161026","Geen verstrekking in Open Data","167321","Nee",,,,,,,"4","4","0","0",,"0","0","M1",,,"r. motorruimte by voorwielscherm","3200","4L",,"e1*2001/116*0350*26","XCZACQ2","QA8QA8D6007P4L067MVEM1S7FLK1","0","0.13","300","Ja","Nee",,"Nee","6700","0","0.00","2023","Geen oordeel","05","Nee","2023-09-08T00:00:00.000",,"2016-09-08T00:00:00.000","2016-10-26T00:00:00.000",,,,,,,,,,,,,,,,,,,,,"E",,,,,,,"https://opendata.rdw.nl/resource/3huj-srit.json","https://opendata.rdw.nl/resource/8ys7-d773.json","https://opendata.rdw.nl/resource/vezc-m2t6.json","https://opendata.rdw.nl/resource/jhie-znh9.json","https://opendata.rdw.nl/resource/kmfi-hrps.json"
"KR767X","Personenauto","AUDI","SQ7","20241012",,"27914","stationwagen","5","GRIJS","Niet geregistreerd","8","3956","2245","3030","2345","750","3500","20161012","20170121","Geen verstrekking in Open Data","136714","Nee",,,,,,,"4","4","0","0",,"0","0","M1",,,"r. motorruimte by voorwielscherm","3030","4L",,"e1*2001/116*0350*26","XCZACQ1","QA8QA8D6007P4L067MVEM1S5FLK1","0","0.14","300","Ja","Nee",,"Nee","6530","0","0.00","2023","Logisch","00","Nee","2024-10-12T00:00:00.000",,"2016-10-12T00:00:00.000","2017-01-21T00:00:00.000",,,,,,,,,,,,,,,,,,,,,"E",,,,,,,"https://opendata.rdw.nl/resource/3huj-srit.json","https://opendata.rdw.nl/resource/8ys7-d773.json","https://opendata.rdw.nl/resource/vezc-m2t6.json","https://opendata.rdw.nl/resource/jhie-znh9.json","https://opendata.rdw.nl/resource/kmfi-hrps.json"
"KS252X","Personenauto","AUDI","SQ7","20250308","20240308","31407","stationwagen","7","GRIJS","Niet geregistreerd","8","3956","2305","3200","2405","750","3500","20161125","20161125","Geen verstrekking in Open Data","175413","Ja",,,,,,,"4","4","0","0",,"505","197","M1",,,"in motorruimte r.","3200","4L",,"e1*2001/116*0350*26","XCZACQ2","QA8QA8D6007P4L077MVEM1S7FLK1","0","0.13","300","Ja","Nee",,"Nee","6700","0","0.00","2024","Logisch","00","Nee","2025-03-08T00:00:00.000","2024-03-08T00:00:00.000","2016-11-25T00:00:00.000","2016-11-25T00:00:00.000",,,,,,,,,,,"167",,,,,,,,,,"D",,,,,,,"https://opendata.rdw.nl/resource/3huj-srit.json","https://opendata.rdw.nl/resource/8ys7-d773.json","https://opendata.rdw.nl/resource/vezc-m2t6.json","https://opendata.rdw.nl/resource/jhie-znh9.json","https://opendata.rdw.nl/resource/kmfi-hrps.json"