"kenteken","voertuigsoort","merk","handelsbenaming","vervaldatum_apk","datum_tenaamstelling","bruto_bpm","inrichting","aantal_zitplaatsen","eerste_kleur","tweede_kleur","aantal_cilinders","cilinderinhoud","massa_ledig_voertuig","toegestane_maximum_massa_voertuig","massa_rijklaar","maximum_massa_trekken_ongeremd","maximum_trekken_massa_geremd","datum_eerste_toelating","datum_eerste_tenaamstelling_in_nederland","wacht_op_keuren","catalogusprijs","wam_verzekerd","maximale_constructiesnelheid","laadvermogen","oplegger_geremd","aanhangwagen_autonoom_geremd","aanhangwagen_middenas_geremd","aantal_staanplaatsen","aantal_deuren","aantal_wielen","afstand_hart_koppeling_tot_achterzijde_voertuig","afstand_voorzijde_voertuig_tot_hart_koppeling","afwijkende_maximum_snelheid","lengte","breedte","europese_voertuigcategorie","europese_voertuigcategorie_toevoeging","europese_uitvoeringcategorie_toevoeging","plaats_chassisnummer","technische_max_massa_voertuig","type","type_gasinstallatie","typegoedkeuringsnummer","variant","uitvoering","volgnummer_wijziging_eu_typegoedkeuring","vermogen_massarijklaar","wielbasis","export_indicator","openstaande_terugroepactie_indicator","vervaldatum_tachograaf","taxi_indicator","maximum_massa_samenstelling","aantal_rolstoelplaatsen","maximum_ondersteunende_snelheid","jaar_laatste_registratie_tellerstand","tellerstandoordeel","code_toelichting_tellerstandoordeel","tenaamstellen_mogelijk","vervaldatum_apk_dt","datum_tenaamstelling_dt","datum_eerste_toelating_dt","datum_eerste_tenaamstelling_in_nederland_dt","vervaldatum_tachograaf_dt","maximum_last_onder_de_vooras_sen_tezamen_koppeling","type_remsysteem_voertuig_code","rupsonderstelconfiguratiecode","wielbasis_voertuig_minimum","wielbasis_voertuig_maximum","lengte_voertuig_minimum","lengte_voertuig_maximum","breedte_voertuig_minimum","breedte_voertuig_maximum","hoogte_voertuig","hoogte_voertuig_minimum","hoogte_voertuig_maximum","massa_bedrijfsklaar_minimaal","massa_bedrijfsklaar_maximaal","technisch_toelaatbaar_massa_koppelpunt","maximum_massa_technisch_maximaal","maximum_massa_technisch_minimaal","subcategorie_nederland","verticale_belasting_koppelpunt_getrokken_voertuig","zuinigheidsclassificatie","registratie_datum_goedkeuring_afschrijvingsmoment_bpm","registratie_datum_goedkeuring_afschrijvingsmoment_bpm_dt","gem_lading_wrde","aerodyn_voorz","massa_alt_aandr","verl_cab_ind","api_gekentekende_voertuigen_assen","api_gekentekende_voertuigen_brandstof","api_gekentekende_voertuigen_carrosserie","api_gekentekende_voertuigen_carrosserie_specifiek","api_gekentekende_voertuigen_voertuigklasse"
"J577GX","Personenauto","AUDI","Q7 E-TRON","20221227",,"390","stationwagen","5","GRIJS","Niet geregistreerd","6","2967","2420","3185","2520","750","3500","20161220","20200728","Geen verstrekking in Open Data","115516","Nee","230",,,,,,"4","4","0","0",,"0","0","M1",,,"r. motorruimte by voorwielscherm","3185","4L",,"e1*2001/116*0350*27","XCVZAQ1","QA8QA8D7003P4L037MMEM1S5FLK1","0","0.02","300","Ja","Nee",,"Nee","6685","0","0.00","2022","Geen oordeel","05","Nee","2022-12-27T00:00:00.000",,"2016-12-20T00:00:00.000","2020-07-28T00:00:00.000",,,,,,,,,,,,,,,,,,,,,"A",,,,,,,"https://opendata.rdw.nl/resource/3huj-srit.json","https://opendata.rdw.nl/resource/8ys7-d773.json","https://opendata.rdw.nl/resource/vezc-m2t6.json","https://opendata.rdw.nl/resource/jhie-znh9.json","https://opendata.rdw.nl/resource/kmfi-hrps.json"
"JX292L","Personenauto","AUDI","Q7 E-TRON","20220707",,"475","stationwagen","5","ZWART","Niet geregistreerd","6","2967","2420","3185","2520","750","3500","20160707","20160707","Geen verstrekking in Open Data","115000","Nee",,,,,,,"4","4","0","0",,"0","0","M1",,,"in motorruimte r.","3185","4L",,"e1*2001/116*0350*25","XCVZAQ1","QA8QA8D7003P4L037MMEM1S5FLK0","0","0.08","300","Ja","Nee",,"Nee","6685","0","0.00","2022","Logisch","00","Nee","2022-07-07T00:00:00.000",,"2016-07-07T00:00:00.000","2016-07-07T00:00:00.000",,,,,,,,,,,,,,,,,,,,,"A",,,,,,,"https://opendata.rdw.nl/resource/3huj-srit.json","https://opendata.rdw.nl/resource/8ys7-d773.json","https://opendata.rdw.nl/resource/vezc-m2t6.json","https://opendata.rdw.nl/resource/jhie-znh9.json","https://opendata.rdw.nl/resource/kmfi-hrps.json"
"JX357K","Personenauto","AUDI","Q7 E-TRON","20240327",,"475","stationwagen","5","ZWART","Niet geregistreerd","6","2967","2420","3185","2520","750","3500","20160712","20160712","Geen verstrekking in Open Data","115000","Nee",,,,,,,"4","4","0","0",,"505","197","M1",,,"in motorruimte r.","3185","4L",,"e1*2001/116*0350*25","XCVZAQ1","QA8QA8D7003P4L037MMEM1S5FLK0","0","0.08","300","Ja","Nee",,"Nee","6685","0","0.00","2023","Logisch","00","Nee","2024-03-27T00:00:00.000",,"2016-07-12T00:00:00.000","2016-07-12T00:00:00.000",,,,,,,,,,,"167",,,,,,,,,,"A",,,,,,,"https://opendata.rdw.nl/resource/3huj-srit.json","https://opendata.rdw.nl/resource/8ys7-d773.json","https://opendata.rdw.nl/resource/vezc-m2t6.json","https://opendata.rdw.nl/resource/jhie-znh9.json","https://opendata.rdw.nl/resource/kmfi-hrps.json"
"JX552K","Personenauto","AUDI","Q7 E-TRON","20231115",,"475","stationwagen","5","ZWART","Niet geregistreerd","6","2967","2420","3185","2520","750","3500","20161003","20161003","Geen verstrekking in Open Data","115000","Nee",,,,,,,"4","4","0","0",,"505","197","M1",,,"in motorruimte r.","3185","4L",,"e1*2001/116*0350*25","XCVZAQ1","QA8QA8D7003P4L037MMEM1S5FLK0","0","0.08","300","Ja","Nee",,"Nee","6685","0","0.00","2023","Logisch","00","Nee","2023-11-15T00:00:00.000",,"2016-10-03T00:00:00.000","2016-10-03T00:00:00.000",,,,,,,,,,,"167",,,,,,,,,,"A",,,,,,,"https://opendata.rdw.nl/resource/3huj-srit.json","https://opendata.rdw.nl/resource/8ys7-d773.json","https://opendata.rdw.nl/resource/vezc-m2t6.json","https://opendata.rdw.nl/resource/jhie-znh9.json","https://opendata.rdw.nl/resource/kmfi-hrps.json"
"JX589K","Personenauto","AUDI","Q7 E-TRON","20240726",,"475","stationwagen","5","ZWART","Niet geregistreerd","6","2967","2420","3185","2520","750","3500","20160711","20160711","Geen verstrekking in Open Data","115000","Nee",,,,,,,"4","4","0","0",,"505","197","M1",,,"in motorruimte r.","3185","4L",,"e1*2001/116*0350*25","XCVZAQ1","QA8QA8D7003P4L037MMEM1S5FLK0","0","0.08","300","Ja","Nee",,"Nee","6685","0","0.00","2023","Logisch","00","Nee","2024-07-26T00:00:00.000",,"2016-07-11T00:00:00.000","2016-07-11T00:00:00.000",,,,,,,,,,,"167",,,,,,,,,,"A",,,,,,,"https://opendata.rdw.nl/resource/3huj-srit.json","https://opendata.rdw.nl/resource/8ys7-d773.json","https://opendata.rdw.nl/resource/vezc-m2t6.json","https://opendata.rdw.nl/resource/jhie-znh9.json","https://opendata.rdw.nl/resource/kmfi-hrps.json"
"JX767K","Personenauto","AUDI","Q7 E-TRON","20230713",,"475","stationwagen","5","ZWART","Niet geregistreerd","6","2967","2420","3185","2520","750","3500","20160713","20160713","Geen verstrekking in Open Data","115000","Nee",,,,,,,"4","4","0","0",,"505","197","M1",,,"in motorruimte r.","3185","4L",,"e1*2001/116*0350*25","XCVZAQ1","QA8QA8D7003P4L037MMEM1S5FLK0","0","0.08","300","Ja","Nee",,"Nee","6685","0","0.00","2022","Logisch","00","Nee","2023-07-13T00:00:00.000",,"2016-07-13T00:00:00.000","2016-07-13T00:00:00.000",,,,,,,,,,,"167",,,,,,,,,,"A",,,,,,,"https://opendata.rdw.nl/resource/3huj-srit.json","https://opendata.rdw.nl/resource/8ys7-d773.json","https://opendata.rdw.nl/resource/vezc-m2t6.json","https://opendata.rdw.nl/resource/jhie-znh9.json","https://opendata.rdw.nl/resource/kmfi-hrps.json"
"JZ021T","Personenauto","AUDI","Q7 E-TRON","20221228",,"475","stationwagen","5","BLAUW","Niet geregistreerd","6","2967","2420","3185","2520","750","3500","20161223","20161223","Geen verstrekking in Open Data","115000","Nee",,,,,,,"4","4","0","0",,"0","0","M1",,,"in motorruimte r.","3185","4L",,"e1*2001/116*0350*25","XCVZAQ1","QA8QA8D7003P4L037MMEM1S5FLK0","0","0.08","300","Ja","Nee",,"Nee","6685","0","0.00","2022","Logisch","00","Nee","2022-12-28T00:00:00.000",,"2016-12-23T00:00:00.000","2016-12-23T00:00:00.000",,,,,,,,,,,,,,,,,,,,,"A",,,,,,,"https://opendata.rdw.nl/resource/3huj-srit.json","https://opendata.rdw.nl/resource/8ys7-d773.json","https://opendata.rdw.nl/resource/vezc-m2t6.json","https://opendata.rdw.nl/resource/jhie-znh9.json","https://opendata.rdw.nl/resource/kmfi-hrps.json"
"JZ023T","Personenauto","AUDI","Q7 E-TRON","20220722",,"475","stationwagen","5","BLAUW","Niet geregistreerd","6","2967","2420","3185","2520","750","3500","20160714","20160714","Geen verstrekking in Open Data","115000","Nee",,,,,,,"4","4","0","0",,"0","0","M1",,,"in motorruimte r.","3185","4L",,"e1*2001/116*0350*25","XCVZAQ1","QA8QA8D7003P4L037MMEM1S5FLK0","0","0.08","300","Ja","Nee",,"Nee","6685","0","0.00","2022","Logisch","00","Nee","2022-07-22T00:00:00.000",,"2016-07-14T00:00:00.000","2016-07-14T00:00:00.000",,,,,,,,,,,,,,,,,,,,,"A",,,,,,,"https://opendata.rdw.nl/resource/3huj-srit.json","https://opendata.rdw.nl/resource/8ys7-d773.json","https://opendata.rdw.nl/resource/vezc-m2t6.json","https://opendata.rdw.nl/resource/jhie-znh9.json","https://opendata.rdw.nl/resource/kmfi-hrps.json"
"JZ056T","Personenauto","AUDI","Q7 E-TRON","20241010","20240501","475","stationwagen","5","ZWART","Niet geregistreerd","6","2967","2420","3185","2520","750","3500","20160825","20160825","Geen verstrekking in Open Data","115000","Ja",,,,,,,"4","4","0","0",,"505","197","M1",,,"in motorruimte r.","3185","4L",,"e1*2001/116*0350*25","XCVZAQ1","QA8QA8D7003P4L037MMEM1S5FLK0","0","0.08","300","Ja","Nee",,"Nee","6685","0","0.00","2024","Logisch","00","Nee","2024-10-10T00:00:00.000","2024-05-01T00:00:00.000","2016-08-25T00:00:00.000","2016-08-25T00:00:00.000",,,,,,,,,,,"167",,,,,,,,,,"A",,,,,,,"https://opendata.rdw.nl/resource/3huj-srit.json","https://opendata.rdw.nl/resource/8ys7-d773.json","https://opendata.rdw.nl/resource/vezc-m2t6.json","https://opendata.rdw.nl/resource/jhie-znh9.json","https://opendata.rdw.nl/resource/kmfi-hrps.json"
"JZ563T","Personenauto","AUDI","Q7 E-TRON","20230707",,"475","stationwagen","5","ZWART","Niet geregistreerd","6","2967","2420","3185","2520","750","3500","20161221","20161221","Geen verstrekking in Open Data","115000","Nee",,,,,,,"4","4","0","0",,"0","0","M1",,,"in motorruimte r.","3185","4L",,"e1*2001/116*0350*25","XCVZAQ1","QA8QA8D7003P4L037MMEM1S5FLK0","0","0.08","300","Ja","Nee",,"Nee","6685","0","0.00","2022","Logisch","00","Nee","2023-07-07T00:00:00.000",,"2016-12-21T00:00:00.000","2016-12-21T00:00:00.000",,,,,,,,,,,,,,,,,,,,,"A",,,,,,,"https://opendata.rdw.nl/resource/3huj-srit.json","https://opendata.rdw.nl/resource/8ys7-d773.json","https://opendata.rdw.nl/resource/vezc-m2t6.json","https://opendata.rdw.nl/resource/jhie-znh9.json","https://opendata.rdw.nl/resource/kmfi-hrps.json"
"JZ942S","Personenauto","AUDI","Q7 E-TRON","20231115",,"475","stationwagen","5","BLAUW","Niet geregistreerd","6","2967","2420","3185","2520","750","3500","20161115","20161115","Geen verstrekking in Open Data","115000","Nee",,,,,,,"4","4","0","0",,"505","197","M1",,,"in motorruimte r.","3185","4L",,"e1*2001/116*0350*25","XCVZAQ1","QA8QA8D7003P4L037MMEM1S5FLK0","0","0.08","300","Ja","Nee",,"Nee","6685","0","0.00","2023","Logisch","00","Nee","2023-11-15T00:00:00.000",,"2016-11-15T00:00:00.000","2016-11-15T00:00:00.000",,,,,,,,,,,"167",,,,,,,,,,"A",,,,,,,"https://opendata.rdw.nl/resource/3huj-srit.json","https://opendata.rdw.nl/resource/8ys7-d773.json","https://opendata.rdw.nl/resource/vezc-m2t6.json","https://opendata.rdw.nl/resource/jhie-znh9.json","https://opendata.rdw.nl/resource/kmfi-hrps.json"
"JZ974S","Personenauto","AUDI","Q7 E-TRON","20230624",,"475","stationwagen","5","BLAUW","Niet geregistreerd","6","2967","2420","3185","2520","750","3500","20160826","20160826","Geen verstrekking in Open Data","115000","Nee",,,,,,,"4","4","0","0",,"505","197","M1",,,"in motorruimte r.","3185","4L",,"e1*2001/116*0350*25","XCVZAQ1","QA8QA8D7003P4L037MMEM1S5FLK0","0","0.08","300","Ja","Nee",,"Nee","6685","0","0.00","2022","Logisch","00","Nee","2023-06-24T00:00:00.000",,"2016-08-26T00:00:00.000","2016-08-26T00:00:00.000",,,,,,,,,,,"167",,,,,,,,,,"A",,,,,,,"https://opendata.rdw.nl/resource/3huj-srit.json","https://opendata.rdw.nl/resource/8ys7-d773.json","https://opendata.rdw.nl/resource/vezc-m2t6.json","https://opendata.rdw.nl/resource/jhie-znh9.json","https://opendata.rdw.nl/resource/kmfi-hrps.json"
"KB109T","Personenauto","AUDI","Q7 E-TRON","20230729",,"475","stationwagen","5","GRIJS","Niet geregistreerd","6","2967","2420","3185","2520","750","3500","20160729","20160729","Geen verstrekking in Open Data","115378","Nee",,,,,,,"4","4","0","0",,"505","197","M1",,,"in motorruimte r.","3185","4L",,"e1*2001/116*0350*25","XCVZAQ1","QA8QA8D7003P4L037MMEM1S5FLK0","0","0.08","300","Ja","Nee",,"Nee","6685","0","0.00","2023","Logisch","00","Nee","2023-07-29T00:00:00.000",,"2016-07-29T00:00:00.000","2016-07-29T00:00:00.000",,,,,,,,,,,"167",,,,,,,,,,"A",,,,,,,"https://opendata.rdw.nl/resource/3huj-srit.json","https://opendata.rdw.nl/resource/8ys7-d773.json","https://opendata.rdw.nl/resource/vezc-m2t6.json","https://opendata.rdw.nl/resource/jhie-znh9.json","https://opendata.rdw.nl/resource/kmfi-hrps.json"
"KB136T","Personenauto","AUDI","Q7 E-TRON","20240509",,"463","stationwagen","5","BRUIN","Niet geregistreerd","6","2967","2420","3185","2520","750","3500","20160729","20160729","Geen verstrekking in Open Data","111035","Nee",,,,,,,"4","4","0","0",,"505","197","M1",,,"in motorruimte r.","3185","4L",,"e1*2001/116*0350*25","XCVZAQ1","QA8QA8D7003P4L087MMEM1S5FLK0","0","0.08","300","Ja","Nee",,"Nee","6685","0","0.00","2023","Logisch","00","Nee","2024-05-09T00:00:00.000",,"2016-07-29T00:00:00.000","2016-07-29T00:00:00.000",,,,,,,,,,,"167",,,,,,,,,,"A",,,,,,,"https://opendata.rdw.nl/resource/3huj-srit.json","https://opendata.rdw.nl/resource/8ys7-d773.json","https://opendata.rdw.nl/resource/vezc-m2t6.json","https://opendata.rdw.nl/resource/jhie-znh9.json","https://opendata.rdw.nl/resource/kmfi-hrps.json"
"KB189Z","Personenauto","AUDI","Q7 E-TRON","20240916","20240404","475","stationwagen","5","BLAUW","Niet geregistreerd","6","2967","2420","3185","2520","750","3500","20160729","20160729","Geen verstrekking in Open Data","107103","Ja",,,,,,,"4","4","0","0",,"505","197","M1",,,"in motorruimte r.","3185","4L",,"e1*2001/116*0350*25","XCVZAQ1","QA8QA8D7003P4L037MMEM1S5FLK0","0","0.08","300","Ja","Nee",,"Nee","6685","0","0.00","2024","Logisch","00","Nee","2024-09-16T00:00:00.000","2024-04-04T00:00:00.000","2016-07-29T00:00:00.000","2016-07-29T00:00:00.000",,,,,,,,,,,"167",,,,,,,,,,"A",,,,,,,"https://opendata.rdw.nl/resource/3huj-srit.json","https://opendata.rdw.nl/resource/8ys7-d773.json","https://opendata.rdw.nl/resource/vezc-m2t6.json","https://opendata.rdw.nl/resource/jhie-znh9.json","https://opendata.rdw.nl/resource/kmfi-hrps.json"
"KB247Z","Personenauto","AUDI","Q7 E-TRON","20230820",,"475","stationwagen","5","GRIJS","Niet geregistreerd","6","2967","2420","3185","2520","750","3500","20160805","20160805","Geen verstrekking in Open Data","111789","Nee",,,,,,,"4","4","0","0",,"505","197","M1",,,"in motorruimte r.","3185","4L",,"e1*2001/116*0350*25","XCVZAQ1","QA8QA8D7003P4L037MMEM1S5FLK0","0","0.08","300","Ja","Nee",,"Nee","6685","0","0.00","2022","Logisch","00","Nee","2023-08-20T00:00:00.000",,"2016-08-05T00:00:00.000","2016-08-05T00:00:00.000",,,,,,,,,,,"167",,,,,,,,,,"A",,,,,,,"https://opendata.rdw.nl/resource/3huj-srit.json","https://opendata.rdw.nl/resource/8ys7-d773.json","https://opendata.rdw.nl/resource/vezc-m2t6.json","https://opendata.rdw.nl/resource/jhie-znh9.json","https://opendata.rdw.nl/resource/kmfi-hrps.json"
"KB304R","Personenauto","AUDI","Q7 E-TRON","20220729",,"475","stationwagen","5","BRUIN","Niet geregistreerd","6","2967","2420","3185","2520","750","3500","20160729","20160729","Geen verstrekking in Open Data","137354","Nee",,,,,,,"4","4","0","0",,"0","0","M1",,,"in motorruimte r.","3185","4L",,"e1*2001/116*0350*25","XCVZAQ1","QA8QA8D7003P4L037MMEM1S5FLK0","0","0.08","300","Ja","Nee",,"Nee","6685","0","0.00","2022","Logisch","00","Nee","2022-07-29T00:00:00.000",,"2016-07-29T00:00:00.000","2016-07-29T00:00:00.000",,,,,,,,,,,,,,,,,,,,,"A",,,,,,,"https://opendata.rdw.nl/resource/3huj-srit.json","https://opendata.rdw.nl/resource/8ys7-d773.json","https://opendata.rdw.nl/resource/vezc-m2t6.json","https://opendata.rdw.nl/resource/jhie-znh9.json","https://opendata.rdw.nl/resource/kmfi-hrps.json"
"KB310L","Personenauto","AUDI","Q7 E-TRON","20240725",,"463","stationwagen","5","GRIJS","Niet geregistreerd","6","2967","2420","3185","2520","750","3500","20160725","20160725","Geen verstrekking in Open Data","108463","Nee",,,,,,,"4","4","0","0",,"505","197","M1",,,"in motorruimte r.","3185","4L",,"e1*2001/116*0350*25","XCVZAQ1","QA8QA8D7003P4L087MMEM1S5FLK0","0","0.08","300","Ja","Nee",,"Nee","6685","0","0.00","2023","Logisch","00","Nee","2024-07-25T00:00:00.000",,"2016-07-25T00:00:00.000","2016-07-25T00:00:00.000",,,,,,,,,,,"167",,,,,,,,,,"A",,,,,,,"https://opendata.rdw.nl/resource/3huj-srit.json","https://opendata.rdw.nl/resource/8ys7-d773.json","https://opendata.rdw.nl/resource/vezc-m2t6.json","https://opendata.rdw.nl/resource/jhie-znh9.json","https://opendata.rdw.nl/resource/kmfi-hrps.json"
"KB470N","Personenauto","AUDI","Q7 E-TRON","20240525","20240126","463","stationwagen","5","GRIJS","Niet geregistreerd","6","2967","2420","3185","2520","750","3500","20160727","20160727","Geen verstrekking in Open Data","99413","Ja",,,,,,,"4","4","0","0",,"505","197","M1",,,"in motorruimte r.","3185","4L",,"e1*2001/116*0350*25","XCVZAQ1","QA8QA8D7003P4L087MMEM1S5FLK0","0","0.08","300","Ja","Nee",,"Nee","6685","0","0.00","2024","Logisch","00","Nee","2024-05-25T00:00:00.000","2024-01-26T00:00:00.000","2016-07-27T00:00:00.000","2016-07-27T00:00:00.000",,,,,,,,,,,"167",,,,,,,,,,"A",,,,,,,"https://opendata.rdw.nl/resource/3huj-srit.json","https://opendata.rdw.nl/resource/8ys7-d773.json","https://opendata.rdw.nl/resource/vezc-m2t6.json","https://opendata.rdw.nl/resource/jhie-znh9.json","https://opendata.rdw.nl/resource/kmfi-hrps.json"
"KB799R","Personenauto","AUDI","Q7 E-TRON","20230916",,"475","stationwagen","5","BLAUW","Niet geregistreerd","6","2967","2420","3185","2520","750","3500","20160729","20160729","Geen verstrekking in Open Data","121750","Nee",,,,,,,"4","4","0","0",,"505","197","M1",,,"in motorruimte r.","3185","4L",,"e1*2001/116*0350*25","XCVZAQ1","QA8QA8D7003P4L037MMEM1S5FLK0","0","0.08","300","Ja","Nee",,"Nee","6685","0","0.00","2023","Logisch","00","Nee","2023-09-16T00:00:00.000",,"2016-07-29T00:00:00.000","2016-07-29T00:00:00.000",,,,,,,,,,,"167",,,,,,,,,,"A",,,,,,,"https://opendata.rdw.nl/resource/3huj-srit.json","https://opendata.rdw.nl/resource/8ys7-d773.json","https://opendata.rdw.nl/resource/vezc-m2t6.json","https://opendata.rdw.nl/resource/jhie-znh9.json","https://opendata.rdw.nl/resource/kmfi-hrps.json"
"KF390B","Personenauto","AUDI","Q7 E-TRON","20240320",,"475","stationwagen","5","GRIJS","Niet geregistreerd","6","2967","2420","3185","2520","750","3500","20160811","20160811","Geen verstrekking in Open Data","111344","Nee",,,,,,,"4","4","0","0",,"505","197","M1",,,"in motorruimte r.","3185","4L",,"e1*2001/116*0350*25","XCVZAQ1","QA8QA8D7003P4L037MMEM1S5FLK0","0","0.08","300","Ja","Nee",,"Nee","6685","0","0.00","2023","Logisch","00","Nee","2024-03-20T00:00:00.000",,"2016-08-11T00:00:00.000","2016-08-11T00:00:00.000",,,,,,,,,,,"167",,,,,,,,,,"A",,,,,,,"https://opendata.rdw.nl/resource/3huj-srit.json","https://opendata.rdw.nl/resource/8ys7-d773.json","https://opendata.rdw.nl/resource/vezc-m2t6.json","https://opendata.rdw.nl/resource/jhie-znh9.json","https://opendata.rdw.nl/resource/kmfi-hrps.json"
"KF711N","Personenauto","AUDI","Q7 E-TRON","20231216",,"475","stationwagen","5","GRIJS","Niet geregistreerd","6","2967","2420","3185","2520","750","3500","20160820","20160820","Geen verstrekking in Open Data","102713","Nee",,,,,,,"4","4","0","0",,"505","197","M1",,,"in motorruimte r.","3185","4L",,"e1*2001/116*0350*25","XCVZAQ1","QA8QA8D7003P4L037MMEM1S5FLK0","0","0.08","300","Ja","Nee",,"Nee","6685","0","0.00","2023","Onlogisch","04","Nee","2023-12-16T00:00:00.000",,"2016-08-20T00:00:00.000","2016-08-20T00:00:00.000",,,,,,,,,,,"167",,,,,,,,,,"A",,,,,,,"https://opendata.rdw.nl/resource/3huj-srit.json","https://opendata.rdw.nl/resource/8ys7-d773.json","https://opendata.rdw.nl/resource/vezc-m2t6.json","https://opendata.rdw.nl/resource/jhie-znh9.json","https://opendata.rdw.nl/resource/kmfi-hrps.json"
"KF869X","Personenauto","AUDI","Q7 E-TRON","20230826",,"475","stationwagen","5","GRIJS","Niet geregistreerd","6","2967","2420","3185","2520","750","3500","20160826","20160826","Geen verstrekking in Open Data","112077","Nee",,,,,,,"4","4","0","0",,"0","0","M1",,,"in motorruimte r.","3185","4L",,"e1*2001/116*0350*25","XCVZAQ1","QA8QA8D7003P4L037MMEM1S5FLK0","0","0.08","300","Ja","Nee",,"Nee","6685","0","0.00","2022","Logisch","00","Nee","2023-08-26T00:00:00.000",,"2016-08-26T00:00:00.000","2016-08-26T00:00:00.000",,,,,,,,,,,,,,,,,,,,,"A",,,,,,,"https://opendata.rdw.nl/resource/3huj-srit.json","https://opendata.rdw.nl/resource/8ys7-d773.json","https://opendata.rdw.nl/resource/vezc-m2t6.json","https://opendata.rdw.nl/resource/jhie-znh9.json","https://opendata.rdw.nl/resource/kmfi-hrps.json"
"KG016N","Personenauto","AUDI","Q7 E-TRON","20240204",,"475","stationwagen","5","ZWART","Niet geregistreerd","6","2967","2420","3185","2520","750","2800","20160902","20160902","Geen verstrekking in Open Data","104328","Nee",,,,,,,"4","4","0","0",,"505","197","M1",,,"in motorruimte r.","3185","4L",,"e1*2001/116*0350*25","XCVZAQ1","QA8QA8D7003P4L037MMEM1S5FSK0","0","0.08","300","Ja","Nee",,"Nee","5985","0","0.00","2023","Logisch","00","Nee","2024-02-04T00:00:00.000",,"2016-09-02T00:00:00.000","2016-09-02T00:00:00.000",,,,,,,,,,,"171",,,,,,,,,,"A",,,,,,,"https://opendata.rdw.nl/resource/3huj-srit.json","https://opendata.rdw.nl/resource/8ys7-d773.json","https://opendata.rdw.nl/resource/vezc-m2t6.json","https://opendata.rdw.nl/resource/jhie-znh9.json","https://opendata.rdw.nl/resource/kmfi-hrps.json"
"KG057N","Personenauto","AUDI","Q7 E-TRON","20230325",,"463","stationwagen","5","BLAUW","Niet geregistreerd","6","2967","2420","3185","2520","750","3500","20160901","20160901","Geen verstrekking in Open Data","105778","Nee",,,,,,,"4","4","0","0",,"505","197","M1",,,"in motorruimte r.","3185","4L",,"e1*2001/116*0350*25","XCVZAQ1","QA8QA8D7003P4L087MMEM1S5FLK0","0","0.08","300","Ja","Nee",,"Nee","6685","0","0.00","2023","Logisch","00","Nee","2023-03-25T00:00:00.000",,"2016-09-01T00:00:00.000","2016-09-01T00:00:00.000",,,,,,,,,,,"167",,,,,,,,,,"A",,,,,,,"https://opendata.rdw.nl/resource/3huj-srit.json","https://opendata.rdw.nl/resource/8ys7-d773.json","https://opendata.rdw.nl/resource/vezc-m2t6.json","https://opendata.rdw.nl/resource/jhie-znh9.json","https://opendata.rdw.nl/resource/kmfi-hrps.json"
"KG091R","Personenauto","AUDI","Q7 E-TRON","20230401",,"463","stationwagen","5","ZWART","Niet geregistreerd","6","2967","2420","3185","2520","750","3500","20160906","20160906","Geen verstrekking in Open Data","98189","Nee",,,,,,,"4","4","0","0",,"0","0","M1",,,"in motorruimte r.","3185","4L",,"e1*2001/116*0350*25","XCVZAQ1","QA8QA8D7003P4L087MMEM1S5FLK0","0","0.08","300","Ja","Nee",,"Nee","6685","0","0.00","2022","Logisch","00","Nee","2023-04-01T00:00:00.000",,"2016-09-06T00:00:00.000","2016-09-06T00:00:00.000",,,,,,,,,,,,,,,,,,,,,"A",,,,,,,"https://opendata.rdw.nl/resource/3huj-srit.json","https://opendata.rdw.nl/resource/8ys7-d773.json","https://opendata.rdw.nl/resource/vezc-m2t6.json","https://opendata.rdw.nl/resource/jhie-znh9.json","https://opendata.rdw.nl/resource/kmfi-hrps.json"